program: Gaussian 09
title: 000047608
version: EM64L-G09RevD.01
frameworkgroup: C1[X(C14H15N5O)]
method: RPBEPBE
basis: SDD
operation: Freq
keyword: #p
keyword: freq=noraman
keyword: PBEPBE/SDD
title: #p freq=noraman PBEPBE/SDD
converged: YES YES NO NO
title: Mulliken charges:
elementType: O N N N N N C C C C C C C C C C C C C C H H H H H H H H H H H H H H H
charge: -0.269868 -0.149414 -0.069159 -0.139799 -0.369822 -0.564008 -0.424893 -0.489583 -0.450176 0.359041 -0.095499 0.126863 -0.430339 0.251541 0.193647 -0.317699 -0.367779 -0.247589 -0.223204 -0.227550 0.225664 0.272860 0.268724 0.233884 0.241983 0.259921 0.278032 0.244585 0.266363 0.312734 0.230399 0.231931 0.232129 0.302698 0.303383
chargesum: 0.00000
title: Mulliken charges with hydrogens summed into heavy atoms:
elementType: O N N N N N C C C C C C C C C C C C C C
charge: -0.269868 -0.149414 -0.069159 -0.139799 -0.057087 0.042073 0.073631 0.013024 0.051727 0.359041 -0.095499 0.126863 -0.152307 0.251541 0.193647 -0.073114 -0.101416 -0.017189 0.008727 0.004579
polarizability: 2.25753012e+02 -6.84331385e+00 2.06571368e+02 -8.07191828e+00 -1.30042612e+01 1.34751179e+02
1716.lowfreq: -10.1261 -5.8731 -2.9821 0.0004 0.0006 0.0007 24.6973 38.4310 48.2403
frequency: 24.6480 38.3161 48.2268 64.1918 92.2351 112.1031 136.1623 151.2065 179.5729 194.2402 244.3375 298.4751 317.3191 338.7064 353.1005 364.1586 376.2300 402.2215 406.1091 425.6407 442.5443 510.7028 521.5515 539.9722 590.9776 608.3726 611.4944 613.1808 625.1963 649.3135 693.7438 706.9287 715.6200 725.0004 743.9466 765.4436 788.9757 859.0002 864.3213 899.3932 927.2114 934.4296 937.8803 979.1305 981.8851 989.7648 999.2374 1000.9328 1025.2778 1049.5275 1081.6822 1103.0287 1112.4607 1139.5434 1170.8337 1173.3496 1177.5640 1188.0362 1210.1624 1212.4957 1231.0911 1237.6497 1241.5573 1273.2661 1312.7932 1315.4945 1323.6622 1350.2378 1369.9636 1379.8177 1405.2926 1418.2398 1431.9437 1454.5311 1456.1992 1460.3386 1479.9959 1489.1010 1528.0702 1554.9623 1589.7283 1590.3398 1609.0406 1673.3311 2939.4857 2989.9252 3000.1324 3064.1998 3067.3107 3104.1625 3125.2214 3134.1047 3145.7128 3152.9984 3157.3592 3169.2474 3446.4263 3467.2012 3574.8489
redmass: 4.8768 5.8354 5.8430 4.3887 3.5704 4.4819 4.4381 4.5208 3.2980 5.1310 3.1167 4.6839 2.5989 1.3233 5.2176 4.5516 2.4370 3.3283 3.5136 5.3006 5.3757 2.3330 1.9896 3.9087 4.6527 1.0975 4.2702 5.7595 6.0748 5.1528 5.1149 1.6411 4.6797 4.2561 4.8130 3.9611 2.3307 1.2601 3.3027 1.4849 2.3805 2.4991 1.8712 1.8445 1.3944 5.8308 2.3454 1.4756 2.3244 2.0732 1.6131 3.0205 6.3351 1.9955 4.2803 1.0571 1.7647 1.1170 2.2961 2.2883 1.7950 1.1705 1.7619 2.1275 1.6942 1.3552 1.4450 1.7569 1.8605 8.5116 2.5250 3.1207 2.2270 1.0972 1.1562 1.1569 2.3356 2.3146 4.0836 7.5332 6.1103 5.5964 6.0328 1.1785 1.0699 1.0689 1.0624 1.0899 1.0982 1.0965 1.0850 1.0881 1.0929 1.0923 1.0962 1.1008 1.0417 1.0747 1.1054
irintensity: 0.6340 1.6449 3.0386 1.5620 5.8393 3.5909 0.0254 2.6750 6.7072 1.6706 3.6342 3.4897 0.4959 78.6849 14.1125 4.0905 2.0479 3.7842 5.7456 0.5019 2.1461 109.8963 80.1413 51.3217 27.1774 63.5976 34.2970 6.6579 4.0614 8.7858 10.5302 86.5412 5.8563 2.1338 0.7583 1.8867 32.8459 2.3013 5.3839 13.6170 14.1018 1.7956 14.7005 24.0873 4.2300 0.6275 0.6688 0.7052 17.2993 18.1602 16.3950 36.5381 44.1613 11.9324 24.4039 0.2257 3.9201 9.2765 2.2423 22.9190 0.0433 1.4854 106.9331 125.7742 36.5515 6.6403 11.4262 23.2427 9.7195 0.6487 160.0528 26.7723 11.1781 24.0676 23.3752 34.6593 11.9039 119.8982 10.4877 191.1900 7.7912 187.5009 3.8781 54.9358 31.3244 35.5752 21.0036 5.0565 20.5256 3.1263 2.3185 3.5735 24.5035 1.3309 20.8448 17.4251 0.9029 34.5870 3.8395
temp: 298.150 k
press: 1.00000 atm
elementType: 8 7 7 7 7 7 6 6 6 6 6 6 6 6 6 6 6 6 6 6 1 1 1 1 1 1 1 1 1 1 1 1 1 1 1
symmnumber: 1
zpe: 724651.7 jmol-1
zpe.correction: 0.276005 hartree
zpe.thermalcorrener: 0.293249 hartree
zpe.thermalcorrenthalpy: 0.294193 hartree
zpe.thermalcorrgfe: 0.229621 hartree
zpe.sumelectzpe: -889.986105 hartree
zpe.sumelectthermal: -889.968862 hartree
zpe.sumelectthermalent: -889.967918 hartree
zpe.sumelectthermalfe: -890.032489 hartree
dipole: 1.1976 7.3561 -2.5066
dipole: 7.8632
quadrupole: -116.2949 -108.4957 -110.7881
quadrupole: 9.9033 -5.9369 4.3641
quadrupole: -4.4353 3.3639 1.0715 9.9033 -5.9369 4.3641
hfenergy: -890.2621103 hartree
pointgroup: C01 [X(C14H15N5O1)]
dipole: 0.3206735 -2.8173795 1.236914 debye
polarizability: 225.3195405|7.689239|203.5130185|11.2109055|-18.5612415|138.2430007 unknown
InChI: InChI=1S/C14H15N5O/c15-16-13-8-11-9-19(7-6-12(11)17-18-13)14(20)10-4-2-1-3-5-10/h1-5,8,16H,6-7,9,15H2
charge 0 multiplicity 1
35 atoms
O  -2.350639 2.358207 -0.768279
N  -0.714396 1.281999 0.491358
N  3.356778 1.360938 -0.640889
N  4.161469 0.26086 -0.550608
N  4.557593 -1.957549 0.005221
N  4.217527 -3.217023 0.508658
C  0.042209 2.551074 0.62075
C  0.045857 0.069513 0.847181
C  1.228509 2.562929 -0.364713
C  1.488705 0.1126 0.343506
C  2.052765 1.298584 -0.216155
C  -1.928057 1.298197 -0.201621
C  2.308261 -1.020558 0.446063
C  -2.760723 0.039345 -0.232565
C  3.644938 -0.909353 -0.022894
C  -2.981231 -0.760076 0.919392
C  -3.445589 -0.273929 -1.434546
C  -3.859109 -1.865236 0.864066
C  -4.306301 -1.390026 -1.494981
C  -4.515062 -2.189802 -0.345935
H  0.405119 2.635161 1.664018
H  -0.653295 3.377329 0.409015
H  -0.462213 -0.814226 0.427385
H  0.066599 -0.06306 1.950579
H  1.8769 3.440809 -0.196478
H  0.837378 2.642622 -1.397069
H  1.962349 -1.971742 0.861434
H  -2.497791 -0.498372 1.867716
H  -3.305489 0.376807 -2.303783
H  5.490725 -1.747965 -0.366648
H  -4.036636 -2.465301 1.763375
H  -4.822377 -1.630203 -2.430968
H  -5.192435 -3.049907 -0.390471
H  4.677739 -3.473637 1.386368
H  4.157023 -3.962912 -0.189884
