program: Gaussian 16
title: OPT_rc_90
version: ES64L-G16RevA.03
frameworkgroup: C1[X(C74H17NO2S)]
method: RB3LYP
basis: CC-pVDZ
operation: Freq
keyword: #P
keyword: Geom=AllCheck
keyword: Guess=TCheck
keyword: SCRF=Check
keyword: GenChk
keyword: RB3LYP/CC-pVDZ
keyword: Freq
converged: YES YES NO YES
title: Mulliken charges:
elementType: C C C C C C C C C C C C C C C C C C C C C C C C C C C C C C C C C C C C C C C C C C C C C C C C C C C C C C C C C C C C C C N C C C C H H H H S O O C C C H H C C H H C C H H H H H H C H H H
charge: -0.004042 -0.000236 -0.000082 0.000062 -0.003125 -0.007530 -0.001139 -0.005136 -0.001267 -0.000266 0.000148 0.000068 -0.000260 -0.001747 -0.004262 0.023173 0.003318 0.031831 0.009587 -0.004929 -0.004887 0.016798 -0.006183 -0.014912 -0.002365 -0.003986 -0.007472 -0.001158 0.000096 -0.000251 -0.000033 0.000134 -0.000207 -0.000425 0.000181 -0.000535 -0.000533 -0.000006 0.000020 -0.000082 -0.000008 -0.000087 -0.000158 -0.000156 -0.000763 0.000145 -0.000437 -0.000568 0.000137 -0.003649 -0.004795 -0.007786 -0.006129 0.001059 -0.002116 -0.002435 -0.000400 -0.000138 -0.000087 -0.000138 -0.048718 0.182352 -0.485314 0.208134 -0.153910 -0.130108 0.037022 0.046484 0.050403 0.046204 0.041304 0.978716 -0.451639 -0.439575 -0.207641 0.085172 0.078121 -0.011382 -0.010812 0.034681 0.030981 -0.031443 -0.036653 -0.087425 0.054086 0.023699 0.036507 0.052445 0.010730 0.007278 -0.027820 0.040440 0.018392 0.039901 0.039538
chargesum: -0.00000
title: Mulliken charges with hydrogens summed into heavy atoms:
elementType: C C C C C C C C C C C C C C C C C C C C C C C C C C C C C C C C C C C C C C C C C C C C C C C C C C C C C C C C C C C C C C N C C C C S O O C C C C C C C C
charge: -0.004042 -0.000236 -0.000082 0.000062 -0.003125 -0.007530 -0.001139 -0.005136 -0.001267 -0.000266 0.000148 0.000068 -0.000260 -0.001747 -0.004262 0.023173 0.003318 0.031831 0.009587 -0.004929 -0.004887 0.016798 -0.006183 -0.014912 -0.002365 -0.003986 -0.007472 -0.001158 0.000096 -0.000251 -0.000033 0.000134 -0.000207 -0.000425 0.000181 -0.000535 -0.000533 -0.000006 0.000020 -0.000082 -0.000008 -0.000087 -0.000158 -0.000156 -0.000763 0.000145 -0.000437 -0.000568 0.000137 -0.003649 -0.004795 -0.007786 -0.006129 0.001059 -0.002116 -0.002435 -0.000400 -0.000138 -0.000087 -0.000138 -0.048718 0.279239 -0.485314 0.295641 -0.153910 -0.157928 0.055029 0.978716 -0.451639 -0.439575 -0.207641 0.073791 0.067310 0.003238 -0.005672 -0.087425 0.166737 0.138271
chargesum: 0.00000
polarizability: 7.14191447e+02 1.53796767e+01 6.69351665e+02 -3.26101722e+00 7.46645874e+00 6.27465018e+02
1716.lowfreq: -0.0020 -0.0019 -0.0018 1.5366 3.1489 5.0929 10.3767 12.4071 15.4310
redmass: 8.1052 6.0442 7.0107 6.6052 4.2405 1.5163 2.7517 3.3815 3.8367 4.0495 2.7994 2.4262 1.5875 2.4700 5.5322 3.7640 2.5684 4.3279 4.2139 11.9869 11.9886 11.9202 11.9471 11.8894 6.8257 5.1195 4.9419 3.7640 11.9482 11.9290 11.9613 10.5704 11.9332 8.1882 11.4259 5.4271 3.1366 3.0036 11.9902 11.9720 11.9862 11.9690 11.9789 2.9382 11.9906 11.9835 11.9849 11.9663 11.9740 5.5320 4.0141 11.9850 11.9660 11.9882 11.8911 11.9266 2.9677 3.6242 11.9688 11.8585 11.7817 11.9984 11.9854 11.9230 11.9719 11.6799 2.9828 11.9985 11.9962 11.9983 11.6554 6.6400 11.8981 10.0045 11.9971 11.9986 11.9942 11.9840 11.9938 11.6801 4.9374 6.1826 6.9317 7.0254 11.9940 11.9990 11.9845 11.9994 11.9917 1.2250 3.5313 11.9627 11.8198 11.9795 11.3709 11.6951 11.9909 11.8808 11.9823 11.9968 11.9961 11.9987 11.9984 11.9984 11.9939 11.9894 11.9932 11.9942 11.9793 11.9952 11.9861 11.9962 11.9972 11.9920 11.9225 3.0700 11.9940 11.9611 11.9931 11.9917 11.9972 11.9952 11.9807 11.9845 11.9662 11.9998 11.9977 11.9484 4.9524 3.3727 1.5622 11.9795 11.9851 11.9928 1.2955 1.2507 1.3484 1.9957 11.9904 1.3019 2.2462 9.2859 11.0348 9.9576 10.8825 10.9988 4.6137 1.9892 6.0968 2.4152 1.4071 1.9071 1.6928 3.8440 1.5941 1.6037 4.7647 2.8369 11.9904 11.9974 11.9970 11.9926 4.1362 11.9324 11.9394 11.9859 11.9603 11.9802 1.3083 4.7674 2.3688 1.1710 11.9106 10.4615 11.4858 1.1437 11.9937 11.9386 11.9208 1.1877 2.9043 11.9958 11.9954 11.9892 11.9643 11.9907 9.7630 11.9954 11.9956 11.9944 11.9967 11.9963 2.9866 11.9872 11.9959 11.9920 1.3643 1.4513 11.3830 11.5483 11.9882 10.9195 11.9941 11.8830 11.9703 6.2351 1.5181 7.7861 11.9732 11.9759 11.9522 11.9699 11.9964 11.9848 11.9840 11.9788 1.4735 1.2581 1.2841 2.1421 1.1945 1.0422 1.0809 1.0994 10.4653 11.1154 11.1567 11.7750 11.9533 11.8778 11.9144 11.3017 11.3632 1.2692 10.4409 10.4912 1.1306 8.3962 1.0870 11.9970 2.4704 11.9937 11.9960 11.9941 11.9948 11.9982 11.9923 11.9968 11.9995 11.9999 11.9988 11.9996 11.9987 11.9993 11.9990 11.9993 11.9987 11.9873 6.7303 5.9683 6.2221 7.6263 1.0670 1.0664 1.0399 1.0393 1.0988 1.1006 1.0976 1.0957 1.0974 1.1027 1.0617 1.0872 1.0896 1.0898 1.0936 1.0936 1.1164
irintensity: 0.4060 0.0368 0.4930 0.2836 0.3072 0.2575 0.3304 0.2722 0.5426 0.2844 1.4816 0.0892 0.9096 0.7029 0.4237 1.1079 3.3453 2.4584 15.6461 0.0041 0.0059 0.0537 0.1693 0.4899 2.7916 1.9834 5.8961 2.0837 0.0079 0.0900 0.4817 0.0263 0.0145 0.0580 0.0834 1.7623 1.9303 2.1449 0.0078 0.0035 0.0230 0.0010 0.0012 0.0999 0.1224 0.0034 0.0449 0.3256 0.3417 1.6949 1.9212 0.0067 0.0323 0.1699 0.1373 0.1737 21.7264 47.7707 27.9891 27.7874 23.7895 0.1471 0.4113 0.2275 0.6005 0.2651 20.2956 0.0009 0.0070 0.0014 3.5616 86.2830 1.5227 20.9732 0.0277 0.0267 0.0282 0.0620 11.9479 11.5853 2.0751 7.5670 0.3984 91.7473 0.0597 0.0111 0.0214 0.0069 0.0072 4.1069 5.9944 0.0476 0.1195 0.0531 0.1869 0.1424 0.1261 0.0929 0.0511 0.0449 0.0475 0.0254 0.0887 0.0608 0.0101 0.0037 0.1179 0.0214 0.0635 0.0375 0.0098 0.0641 0.0074 0.0265 0.2293 13.4540 0.0379 0.0287 0.0302 0.0693 0.0174 0.0210 0.0224 0.1119 0.0671 0.0015 0.0014 0.0405 10.4611 37.5671 10.8157 0.0447 0.0178 0.0025 26.6791 2.1848 59.0299 16.9335 0.0079 4.3414 56.8676 4.0540 0.6077 1.4393 1.0610 0.1218 1.1750 1.8968 0.5221 33.6692 0.6319 20.9557 2.9910 23.3587 0.3890 22.2329 137.5338 39.4748 0.0218 0.0699 0.1306 0.0533 102.1482 0.0820 0.0681 0.1056 0.1410 0.3105 11.6179 26.5495 1.3786 2.0701 0.0193 0.1730 0.1172 0.7263 12.0164 7.4860 7.6313 8.6590 0.7365 0.0183 0.0187 0.0113 0.0116 0.0414 116.0304 0.1328 0.0057 0.0036 0.0133 0.0166 1.2743 0.0179 0.0030 0.0264 0.2932 0.6382 0.1254 0.0369 0.0210 0.0788 0.0390 0.0019 0.0040 0.4473 3.6782 0.8343 0.0287 0.0085 0.0193 0.0016 0.0130 0.0025 0.0119 0.0190 0.3517 4.0221 5.6924 5.3681 8.2734 7.7507 7.1389 14.7440 0.2015 0.2947 0.1682 0.2133 0.2782 0.3788 0.1470 0.0340 1.6419 11.7823 15.0473 9.7838 5.6292 10.2415 21.0459 0.5232 7.0174 0.0625 0.0096 0.0549 0.0005 0.0334 0.0706 0.1108 0.0123 0.0067 0.0091 0.0253 0.0860 0.0686 0.0880 0.0334 0.2038 0.0620 0.3753 11.2276 11.6313 6.8579 21.0501 23.6939 23.3879 14.7953 31.9043 14.7790 23.6339 10.1170 6.1800 7.7226 0.6131 12.9048 7.4253 5.6310 0.6206 2.4394 3.8632
temp: 363.150 k
press: 1.00000 atm
elementType: 6 6 6 6 6 6 6 6 6 6 6 6 6 6 6 6 6 6 6 6 6 6 6 6 6 6 6 6 6 6 6 6 6 6 6 6 6 6 6 6 6 6 6 6 6 6 6 6 6 6 6 6 6 6 6 6 6 6 6 6 6 6 7 6 6 6 6 1 1 1 1 16 8 8 6 6 6 1 1 6 6 1 1 6 6 1 1 1 1 1 1 6 1 1 1
symmnumber: 1
zpe: 1732639.0 jmol-1
zpe.correction: 0.659927 hartree
zpe.thermalcorrener: 0.722732 hartree
zpe.thermalcorrenthalpy: 0.723882 hartree
zpe.thermalcorrgfe: 0.561609 hartree
zpe.sumelectzpe: -3432.879548 hartree
zpe.sumelectthermal: -3432.816743 hartree
zpe.sumelectthermalent: -3432.815593 hartree
zpe.sumelectthermalfe: -3432.977866 hartree
dipole: 3.0902 0.3818 2.0702
dipole: 3.7391
quadrupole: -488.5115 -426.2347 -440.2654
quadrupole: 0.3377 -12.5370 0.8474
quadrupole: -36.8409 25.4358 11.4051 0.3377 -12.5370 0.8474
hfenergy: -3433.5394752 hartree
pointgroup: C01 [X(C74H17N1O2S1)]
dipole: -1.2342851 0.1761343 -0.7807549 debye
polarizability: 714.3337391|-14.7980644|669.6408423|-5.7611443|-5.1132235|627.0335487 unknown
InChI: InChI=1S/C60.C14H17NO2S/c1-2-5-6-3(1)8-12-10-4(1)9-11-7(2)17-21-13(5)23-24-14(6)22-18(8)28-20(12)30-26-16(10)15(9)25-29-19(11)27(17)37-41-31(21)33(23)43-44-34(24)32(22)42-38(28)48-40(30)46-36(26)35(25)45-39(29)47(37)55-49(41)51(43)57-52(44)50(42)56(48)59-54(46)53(45)58(55)60(57)59;1-4-13-10-15(9-12(13)3)18(16,17)14-7-5-11(2)6-8-14/h;4-8H,3,9-10H2,1-2H3
charge 0 multiplicity 1
95 atoms
C  0.7005727 0.04373198 2.62116433
C  -0.47813753 0.50632068 3.33878028
C  -1.5347517 -0.37411135 3.58848709
C  -1.45655718 -1.75377421 3.13110862
C  -0.32521097 -2.19790309 2.4415244
C  0.77473551 -1.28078596 2.18063946
C  1.15304424 1.12328125 1.75600677
C  0.25626767 2.25399819 1.94017033
C  -0.7530146 1.8727436 2.9180261
C  -2.07356499 2.30378491 2.76346007
C  -2.90962006 0.07538238 3.42749308
C  -2.78327264 -2.15688314 2.68767512
C  -2.9257592 -2.98889777 1.57378088
C  -1.74729289 -3.4520668 0.8556334
C  -0.47343043 -3.06408946 1.28027318
C  0.53330587 -2.6806061 0.30248419
C  1.30196549 -1.57814043 0.85804854
C  1.73973594 -0.54370369 0.03066615
C  1.66010691 0.83422934 0.48676487
C  -0.09634785 3.05261363 0.84743355
C  0.43185488 2.74900479 -0.47352869
C  1.29355137 1.6642141 -0.6496174
C  1.14714132 0.79991086 -1.81128777
C  1.42256887 -0.56560261 -1.39078912
C  0.68169743 -1.62232023 -1.924439
C  0.23144378 -2.7060313 -1.06142138
C  -1.09594526 -3.10787702 -1.50331865
C  -2.06513445 -3.47418512 -0.56454998
C  -3.68124558 -1.02642306 2.87137127
C  -4.69011259 -1.09558502 -1.63269551
C  -5.20059838 -0.80782833 -0.36391589
C  -5.27896565 0.57166157 0.09339608
C  -4.8441757 1.60872435 -0.73618178
C  -4.3125707 1.30930268 -2.05760303
C  -3.05849717 -0.47803259 -3.2145747
C  -2.78361261 -1.84449757 -2.79421252
C  -3.79213924 -2.22595819 -1.8166714
C  -3.4397657 -3.02355245 -0.7243214
C  -3.97156005 -2.72394048 0.59697342
C  -4.83415553 -1.63857385 0.77346975
C  -4.96092025 0.59347612 1.51350366
C  -4.22008553 1.65129906 2.0474768
C  -3.76694377 2.73148957 1.18353727
C  -4.07287119 2.71064596 -0.18003191
C  -3.06485526 3.0923962 -1.15792765
C  -3.21269667 2.2261572 -2.31813972
C  -2.08122977 1.78219349 -3.00857334
C  -2.00261621 0.40243787 -3.46602381
C  -1.46330442 -2.27611264 -2.64064263
C  -0.36339709 -1.35858096 -2.90107777
C  -0.62719925 -0.04654358 -3.30690021
C  0.14416156 1.05491416 -2.75120192
C  -0.75460132 2.18565857 -2.56677224
C  -0.61321335 3.01597085 -1.45115564
C  -1.79090135 3.47996423 -0.73301229
C  -1.47190746 3.50173769 0.68748156
C  -2.44036981 3.13483991 1.6261301
C  -4.68605123 -0.77257774 1.93374091
C  -3.17366621 1.38711044 3.02393022
C  -4.23685653 -0.01538999 -2.49664302
C  4.06318159 -2.84814581 -0.90220298
C  4.77128388 -1.52322819 -1.0972436
N  4.81444402 -0.95876821 0.26672798
C  4.81863049 -2.05684059 1.26123751
C  4.10369815 -3.17990872 0.53840495
C  3.49041144 -3.57363978 -1.87788843
C  3.60498022 -4.26201366 1.15323792
H  4.22107857 -0.83946785 -1.76198106
H  5.78595271 -1.66341049 -1.51233917
H  5.84264678 -2.36288562 1.54337636
H  4.30026415 -1.73682717 2.17528596
S  5.96687104 0.28384628 0.53106079
O  6.23306978 0.27962069 1.99072366
O  7.06395036 0.16249995 -0.46448259
C  5.03060304 1.76369625 0.12487402
C  4.4272481 2.48586033 1.15457402
C  4.96757932 2.19680042 -1.20233738
H  4.51635605 2.13545281 2.18300828
H  5.49071053 1.64032134 -1.98083697
C  3.72892814 3.6530745 0.84047752
C  4.2521502 3.35644436 -1.49764654
H  3.25089244 4.22249727 1.64087367
H  4.18933407 3.69860849 -2.53369578
C  3.62272415 4.10097336 -0.48484751
C  2.82736308 5.33392391 -0.82935652
H  2.62965115 5.95250568 0.05821821
H  3.34877316 5.95378738 -1.57555241
H  1.85159441 5.0508795 -1.26113526
H  3.1085603 -5.06094416 0.59972925
H  3.6765248 -4.37711565 2.23669853
H  3.00619182 -4.51545779 -1.59925568
C  3.44368979 -3.22124699 -3.33275982
H  3.90496773 -2.24763048 -3.55242819
H  3.96340837 -3.9854485 -3.9381519
H  2.40032824 -3.19171199 -3.69349881
