program: Gaussian 16
title: OPT
version: ES64L-G16RevB.01
frameworkgroup: C1[X(C118H49NO2P2RhS)]
method: RB3LYP
basis: Gen
operation: Freq
keyword: #P
keyword: Geom=AllCheck
keyword: Guess=TCheck
keyword: SCRF=Check
keyword: GenChk
keyword: RB3LYP/ChkBas
keyword: Freq
converged: YES YES NO YES
title: Mulliken charges:
elementType: C C C C C C C C C C C C C C C C C C C C C C C C C C C C C C C C C C C C C C C C C C C C C C C C C C C C C C C C C C C C Rh P P C C C C C H C H C C C C H C C H C C C C C C C C H H H H H H H H C C C C C C H H H H H C C C C C C H H H H H C C C C C C H H H H H C C C C C C H H H H H C H H N C H H C C S O O C C C H H C C H H C C H H H C H H H C C H H H
charge: 0.004746 0.004932 -0.000157 0.001985 0.005462 0.003676 0.004714 0.002823 -0.000072 0.012694 -0.007739 0.002638 0.001615 0.001911 0.005422 0.004324 0.004560 0.004926 0.003578 -0.000813 0.001251 0.003956 0.004713 0.004369 0.003781 0.004160 0.004527 -0.000896 -0.020643 -0.071856 0.048145 -0.104551 -0.220529 0.089534 -0.025494 0.008078 -0.014374 -0.014214 -0.030462 0.042693 0.094940 -0.040256 -0.049403 0.084028 0.012754 0.000002 -0.029768 -0.017816 -0.000630 0.002077 -0.003044 0.002642 -0.011834 -0.005040 -0.029818 -0.015034 -0.011965 0.014848 -0.007404 -0.034173 0.208850 0.305731 0.216489 -0.151506 -0.011579 0.062824 0.057813 0.027621 -0.013132 0.033213 -0.034203 -0.142646 0.047314 -0.012680 0.045498 -0.007714 0.053342 0.029978 -0.033022 0.030916 -0.004955 0.059739 0.053649 -0.004172 0.029408 0.059207 0.050989 -0.029912 -0.012073 -0.016460 -0.016886 -0.023271 -0.016208 -0.012400 -0.030182 -0.144549 0.024055 0.051921 0.035027 0.056817 0.055957 0.051283 -0.018331 -0.017749 -0.011425 -0.010604 -0.117028 -0.026265 0.025305 0.051492 0.041854 0.060187 -0.011242 -0.008732 -0.001315 -0.010272 -0.003236 -0.147740 0.054107 0.038567 0.053670 0.042724 0.051713 -0.015287 -0.010884 -0.012311 -0.008205 -0.005675 -0.125952 0.071897 0.031752 0.049724 0.045648 0.049891 -0.023282 -0.002162 -0.012553 -0.018017 -0.011569 0.187773 0.036946 0.036140 -0.448859 0.210675 0.041253 0.094252 -0.046806 -0.265456 0.944523 -0.460025 -0.443477 -0.195889 0.081919 0.101882 -0.007781 -0.011743 0.043496 0.030466 -0.022587 -0.023685 -0.087242 0.054344 0.026512 0.056118 0.050475 0.085386 0.050592 0.041966 0.042606 -0.064161 0.045781 0.052536 0.028429 0.036331
chargesum: 1.00000
title: Mulliken charges with hydrogens summed into heavy atoms:
elementType: C C C C C C C C C C C C C C C C C C C C C C C C C C C C C C C C C C C C C C C C C C C C C C C C C C C C C C C C C C C C Rh P P C C C C C C C C C C C C C C C C C C C C C C C C C C C C C C C C C C C C C C C C C C C C C N C C C S O O C C C C C C C C C C
charge: 0.004746 0.004932 -0.000157 0.001985 0.005462 0.003676 0.004714 0.002823 -0.000072 0.012694 -0.007739 0.002638 0.001615 0.001911 0.005422 0.004324 0.004560 0.004926 0.003578 -0.000813 0.001251 0.003956 0.004713 0.004369 0.003781 0.004160 0.004527 -0.000896 -0.020643 -0.071856 0.048145 -0.104551 -0.220529 0.089534 -0.025494 0.008078 -0.014374 -0.014214 -0.030462 0.042693 0.094940 -0.040256 -0.049403 0.084028 0.012754 0.000002 -0.029768 -0.017816 -0.000630 0.002077 -0.003044 0.002642 -0.011834 -0.005040 -0.029818 -0.015034 -0.011965 0.014848 -0.007404 -0.034173 0.208850 0.305731 0.216489 -0.151506 -0.011579 0.049692 0.057813 -0.006582 0.033213 -0.142646 0.039600 -0.012680 0.012476 0.053342 0.029978 0.001004 -0.021841 0.043279 0.041576 -0.027443 -0.000774 0.042999 0.038590 -0.144549 0.075339 0.033590 0.017278 0.045392 0.045354 -0.117028 -0.037507 0.016573 0.050177 0.031582 0.056951 -0.147740 0.038820 0.027683 0.041359 0.034519 0.046037 -0.125952 0.048615 0.029590 0.037171 0.027632 0.038322 0.260859 -0.448859 0.346181 -0.046806 -0.265456 0.944523 -0.460025 -0.443477 -0.195889 0.074137 0.090139 0.020909 0.006781 -0.087242 0.187449 0.220551 -0.027830 0.126746
chargesum: 0.99999
polarizability: 1.56006687e+03 -2.47802524e+01 1.29361018e+03 1.74464783e+01 1.88995112e+01 1.09245451e+03
1716.lowfreq: -1.5629 -0.0023 -0.0021 -0.0013 1.6697 2.7995 10.1979 13.0727 18.1577
temp: 363.150 k
press: 1.00000 atm
elementType: 6 6 6 6 6 6 6 6 6 6 6 6 6 6 6 6 6 6 6 6 6 6 6 6 6 6 6 6 6 6 6 6 6 6 6 6 6 6 6 6 6 6 6 6 6 6 6 6 6 6 6 6 6 6 6 6 6 6 6 6 45 15 15 6 6 6 6 6 1 6 1 6 6 6 6 1 6 6 1 6 6 6 6 6 6 6 6 1 1 1 1 1 1 1 1 6 6 6 6 6 6 1 1 1 1 1 6 6 6 6 6 6 1 1 1 1 1 6 6 6 6 6 6 1 1 1 1 1 6 6 6 6 6 6 1 1 1 1 1 6 1 1 7 6 1 1 6 6 16 8 8 6 6 6 1 1 6 6 1 1 6 6 1 1 1 6 1 1 1 6 6 1 1 1
symmnumber: 1
zpe: 3384239.3 jmol-1
zpe.correction: 1.288989 hartree
zpe.thermalcorrener: 1.407594 hartree
zpe.thermalcorrenthalpy: 1.408744 hartree
zpe.thermalcorrgfe: 1.134106 hartree
zpe.sumelectzpe: -5921.326058 hartree
zpe.sumelectthermal: -5921.207452 hartree
zpe.sumelectthermalent: -5921.206302 hartree
zpe.sumelectthermalfe: -5921.480940 hartree
dipole: 11.4256 -1.0702 1.9217
dipole: 11.6354
quadrupole: -641.6475 -603.2568 -673.1483
quadrupole: -16.9718 9.7146 14.7416
quadrupole: -2.2966 36.0941 -33.7974 -16.9718 9.7146 14.7416
hfenergy: -5922.6150464 hartree
pointgroup: C01[X(C118H49N1O2P2Rh1S1)]
dipole: 4.4951647 -0.4210602 0.7560521 debye
polarizability: 1560.0667172|-24.7810719|1293.6103336|17.4465365|18.8994575|1092.4545075 unknown
InChI: InChI=1S/C74H17NO2S.C44H32P2.Rh/c1-10-4-6-13(7-5-10)78(76,77)75-8-11(2)14(9-75)12(3)74-71-67-61-47-39-31-19-16-15-17-20(19)32-34-30-24(17)26-22-18(15)21-25-23(16)29-33(31)45(47)53-51-37(29)35(25)43-41-27(21)28(22)42-44-36(26)38(30)52-54-46(34)48(40(32)39)62(61)68(71)64(54)66-58(52)56(44)60-50(42)49(41)59-55(43)57(51)65(63(53)67)72(74)69(59)70(60)73(66)74;1-5-19-35(20-6-1)45(36-21-7-2-8-22-36)41-31-29-33-17-13-15-27-39(33)43(41)44-40-28-16-14-18-34(40)30-32-42(44)46(37-23-9-3-10-24-37)38-25-11-4-12-26-38;/h4-7,11H,2,8-9H2,1,3H3;1-32H;
charge 1 multiplicity 1
174 atoms
C  -7.36658067 1.66224365 0.96461732
C  -6.36440418 2.71067769 0.90069229
C  -5.8519387 3.11728476 -0.33502442
C  -6.32106508 2.48171295 -1.55842479
C  -7.28332822 1.46907567 -1.49618587
C  -7.81740483 1.05177695 -0.20993518
C  -7.10147099 0.8553073 2.14895952
C  -5.9362263 1.40675142 2.81770245
C  -5.47397251 2.5498233 2.0421152
C  -4.10499368 2.78879154 1.89701944
C  -4.42862205 3.37585667 -0.48072778
C  -5.18471103 2.34654853 -2.45540418
C  -5.05885948 1.21076399 -3.25676187
C  -6.06218813 0.15917502 -3.19999667
C  -7.15098542 0.28457246 -2.33278449
C  -7.60267707 -0.8632431 -1.5622587
C  -8.0161438 -0.38884875 -0.2504681
C  -7.7609671 -1.16256474 0.88524273
C  -7.29814039 -0.52854616 2.10994005
C  -5.01003836 0.55459844 3.42655165
C  -5.21422559 -0.88794832 3.38637036
C  -6.33418405 -1.41764536 2.739621
C  -6.20031011 -2.60190376 1.90295065
C  -7.08178183 -2.44307443 0.75723264
C  -6.680357 -2.89901147 -0.50205306
C  -6.94632846 -2.0918458 -1.68643647
C  -5.81196173 -2.22201984 -2.5829406
C  -5.37872707 -1.12076205 -3.32826908
C  -4.01695937 2.8991152 -1.78089508
C  -1.86253226 -1.13773435 -2.18432804
C  -1.66370424 0.22478627 -2.14743237
C  -0.88889823 0.97131931 -1.03692812
C  -0.67570382 0.08476705 0.2474421
C  -1.13916587 -1.34332835 0.16449035
C  -2.58410634 -3.00712919 -0.93828098
C  -3.47332315 -2.84671532 -2.08112212
C  -3.02262489 -1.6978958 -2.84900452
C  -3.95674233 -0.85644455 -3.46482734
C  -3.7592012 0.57430889 -3.4143251
C  -2.64319986 1.0908687 -2.74563941
C  -1.86313126 2.15529424 -0.80841197
C  -2.26729731 2.58966282 0.43787763
C  -2.00151767 1.76861768 1.64104526
C  -1.35912667 0.55006852 1.50467225
C  -1.84386751 -0.57805593 2.25677515
C  -1.70642055 -1.75568036 1.42939431
C  -2.65191508 -2.78463736 1.50828651
C  -3.10878264 -3.42587578 0.29426222
C  -4.84032817 -3.10553968 -1.95169531
C  -5.38225156 -3.52853318 -0.6676356
C  -4.53254596 -3.68550283 0.43258666
C  -4.95150178 -3.21106191 1.74512654
C  -3.7859333 -2.65644435 2.41467289
C  -3.91515951 -1.51898312 3.21505862
C  -2.91724784 -0.46152957 3.14545999
C  -3.58673993 0.81057038 3.28446745
C  -3.13862652 1.90294949 2.52675381
C  -2.7663067 2.28124651 -1.92233755
C  -3.56779109 3.20827576 0.61216065
C  -1.58294319 -1.96228608 -0.99324404
Rh 1.43878696 -0.04631144 0.02779247
P  2.1053827 -1.54741558 1.61663967
P  3.48384015 -0.58048626 -1.34386851
C  2.25102599 -3.10621288 0.63329147
C  3.41547127 -3.45551467 -0.05290763
C  1.04219636 -3.82856282 0.39432988
C  3.39915283 -4.58094079 -0.95111281
C  1.00683768 -4.88418533 -0.48176134
H  0.12747197 -3.5354168 0.90175539
C  2.17603094 -5.29510128 -1.17291651
H  0.06707725 -5.41279113 -0.65586854
C  4.92516461 -1.50176945 -0.60967102
C  6.22241969 -0.91739561 -0.60023992
C  4.70630584 -2.70150537 0.07314244
C  7.24426288 -1.46906908 0.13724352
H  6.41785028 -0.01898751 -1.18184074
C  5.75587563 -3.27926503 0.86000116
C  7.03326575 -2.63253538 0.91922007
H  8.23127267 -1.00065778 0.13626982
C  2.15588943 -6.38933153 -2.07956794
C  4.56196781 -5.00886293 -1.65539544
C  4.51437954 -6.08172944 -2.52023033
C  3.30141821 -6.7795052 -2.73914877
C  5.56018552 -4.4627814 1.62846364
C  8.05173152 -3.17263283 1.75156278
C  6.56579212 -4.96024689 2.42969073
C  7.82349817 -4.30912111 2.49689943
H  1.2139087 -6.91883229 -2.23983287
H  3.27775633 -7.62524523 -3.42930349
H  5.41973299 -6.39372986 -3.04481713
H  5.50170401 -4.47885824 -1.50872964
H  4.59621795 -4.97005471 1.58917286
H  6.39372176 -5.86377546 3.01824604
H  8.61059333 -4.71499191 3.13555694
H  9.01970781 -2.66761915 1.79055829
C  2.86686728 -1.71612772 -2.65703561
C  1.49258653 -1.96558819 -2.7645474
C  3.75374966 -2.37702753 -3.52313902
C  1.00070186 -2.86200461 -3.71446252
C  3.26311302 -3.27131602 -4.47528757
C  1.88861441 -3.51884424 -4.57011965
H  0.79083671 -1.47470462 -2.08949456
H  4.82891666 -2.2067079 -3.43940353
H  -0.07329262 -3.04834075 -3.77293871
H  3.95900627 -3.7921027 -5.13558352
H  1.51244779 -4.23008096 -5.30798853
C  4.21905147 0.84895421 -2.24614639
C  4.88754477 1.85464078 -1.52150304
C  4.09000236 0.98630339 -3.63797164
C  5.45114032 2.94815426 -2.17895968
C  4.63412668 2.09932384 -4.28917022
C  5.32143979 3.07586611 -3.56533874
H  4.97889506 1.79438781 -0.43563842
H  3.56360869 0.23019536 -4.2205549
H  5.94474154 3.72348837 -1.59604327
H  4.51802396 2.19715135 -5.37071145
H  5.73225671 3.95183329 -4.06934794
C  1.06642181 -1.89084494 3.10023579
C  0.74502227 -0.78500202 3.90616984
C  0.6979902 -3.17724997 3.52302322
C  0.04486215 -0.95965632 5.09877891
C  -0.01551812 -3.34558703 4.71364846
C  -0.34816226 -2.23999061 5.50027158
H  1.04072594 0.21873382 3.60284658
H  0.96763591 -4.0558052 2.93802739
H  -0.20678623 -0.09048827 5.70924167
H  -0.30723824 -4.34995767 5.02708385
H  -0.9082167 -2.37601796 6.42746187
C  3.70500694 -1.17975314 2.47271445
C  4.13908902 -2.05573388 3.48301282
C  4.46311492 -0.03715024 2.18512965
C  5.3238502 -1.80036931 4.1726844
C  5.64273921 0.22268897 2.88597965
C  6.07734961 -0.65995327 3.87793231
H  3.55668012 -2.94456425 3.72937198
H  4.14540688 0.6446458 1.39755494
H  5.6612356 -2.49880116 4.94039554
H  6.22498715 1.11458737 2.64651028
H  7.00329991 -0.46087565 4.42096007
C  1.54417792 4.15782976 0.54253694
H  0.47223898 4.36450798 0.68753026
H  2.11087299 4.58754559 1.37720471
N  1.98791101 4.73761719 -0.75728698
C  1.85198702 3.69768446 -1.82743723
H  1.1385 4.05554668 -2.5826379
H  2.80962809 3.51319282 -2.33496671
C  1.29396297 2.48867903 -1.08780737
C  0.44608492 1.58990177 -1.6759488
S  3.56047245 5.44680898 -0.67112785
O  4.44712599 4.66001642 0.24154005
O  3.96672337 5.6739181 -2.07945031
C  3.18147873 7.00265649 0.13110299
C  3.68915272 7.25553309 1.40456253
C  2.41664991 7.9495548 -0.55960844
H  4.29867229 6.50241958 1.90486686
H  2.04567838 7.7300252 -1.56127907
C  3.40757564 8.48565417 2.00569889
C  2.1484668 9.16682524 0.05797746
H  3.80008222 8.69528947 3.00329314
H  1.55170807 9.91531838 -0.46905032
C  2.63679436 9.45494105 1.3476964
C  2.33618579 10.78615082 1.98789855
H  2.74171672 10.85135107 3.00748685
H  2.76848606 11.60997913 1.39596761
H  1.24917797 10.96210766 2.0385124
C  0.47499165 1.55945685 -3.19547442
H  0.28986843 0.54028344 -3.56185745
H  -0.30390421 2.2023113 -3.63732195
H  1.45162299 1.87324907 -3.58300456
C  1.81471259 2.661895 0.32039092
C  1.48080879 1.59086327 1.31802015
H  0.52560477 1.73966795 1.82887962
H  2.27534988 1.47520645 2.0652301
H  2.91087056 2.61824787 0.17199108
