program: Gaussian 09
title: 000046398
version: EM64L-G09RevD.01
frameworkgroup: C1[X(C8H6ClNOS)]
method: RPBEPBE
basis: SDD
operation: Freq
keyword: #p
keyword: freq=noraman
keyword: PBEPBE/SDD
title: #p freq=noraman PBEPBE/SDD
converged: NO NO NO NO
title: Mulliken charges:
elementType: Cl S O N C C C C C C C C H H H H H H
charge: -0.057573 0.300260 -0.236569 -0.010259 0.048786 0.256170 -0.316354 -0.336609 -0.165871 -0.086400 -0.197575 -0.819523 0.283505 0.257904 0.260174 0.283641 0.252657 0.283639
chargesum: 0.00000
title: Mulliken charges with hydrogens summed into heavy atoms:
elementType: Cl S O N C C C C C C C C
charge: -0.057573 0.300260 -0.236569 -0.010259 0.048786 0.256170 -0.032849 -0.078706 -0.165871 -0.086400 0.062598 0.000414
polarizability: 2.18260607e+02 7.33166973e-01 1.11925089e+02 4.15947922e-03 2.83875457e-03 4.97793213e+01
1716.lowfreq: -0.0014 0.0011 0.0013 3.9111 8.8229 14.4049 44.7645 75.3684 123.3159
frequency: 44.5648 75.3536 123.3148 134.7790 168.3173 201.3526 258.3971 308.2733 317.8749 345.9645 421.3156 436.6739 490.8053 582.1465 594.6616 635.0022 649.4644 673.2517 735.4438 787.7944 802.6196 832.6834 876.0728 884.3730 933.7767 980.3537 989.8379 1029.4399 1041.8435 1104.0239 1160.8665 1209.9876 1248.1406 1352.7832 1381.7348 1419.5428 1432.6573 1442.7861 1455.5196 1463.7152 1595.7629 1615.5748 3030.6734 3155.8922 3163.6980 3170.5606 3188.6192 3194.0271
redmass: 3.7676 7.4380 4.9555 1.1434 6.2892 6.0277 6.7221 6.0415 13.6936 8.9595 2.9729 11.3272 6.6907 4.3636 8.1004 10.5863 7.5581 8.5731 4.9058 6.6438 1.3885 12.6237 1.4286 7.0065 1.3312 1.1726 1.7433 3.3028 1.9254 2.2559 2.0394 5.0436 1.3671 1.1339 4.9791 4.9197 3.0434 1.0518 1.0583 10.7483 8.3951 8.7124 1.0280 1.1044 1.1068 1.0891 1.0975 1.0944
irintensity: 1.5933 0.0636 1.1585 0.1624 0.4990 0.6129 0.0601 6.3106 0.1861 0.1420 8.8612 11.9889 1.8529 8.0905 0.6543 1.8426 1.6288 29.6020 0.0004 30.3117 54.2813 23.4981 24.8641 55.2694 1.0677 6.8790 67.7166 57.8197 31.5136 9.0712 6.0400 6.8274 6.9631 2.6445 1.5664 38.3875 208.6663 15.8139 9.5512 279.3049 8.3280 14.5448 15.7858 5.4443 9.0060 0.1445 1.5027 0.5852
temp: 298.150 k
press: 1.00000 atm
elementType: 17 16 8 7 6 6 6 6 6 6 6 6 1 1 1 1 1 1
symmnumber: 1
zpe: 317861.6 jmol-1
zpe.correction: 0.121067 hartree
zpe.thermalcorrener: 0.132001 hartree
zpe.thermalcorrenthalpy: 0.132946 hartree
zpe.thermalcorrgfe: 0.083077 hartree
zpe.sumelectzpe: -1295.676167 hartree
zpe.sumelectthermal: -1295.665232 hartree
zpe.sumelectthermalent: -1295.664288 hartree
zpe.sumelectthermalfe: -1295.714156 hartree
dipole: 2.5372 3.4912 0.0003
dipole: 4.3157
quadrupole: -76.6156 -80.9963 -86.0096
quadrupole: 4.6270 0.0009 0.0005
quadrupole: 4.5916 0.2108 -4.8024 4.6270 0.0009 0.0005
hfenergy: -1295.7972337 hartree
pointgroup: C01 [X(C8H6Cl1N1O1S1)]
dipole: -0.9815009 1.3855242 -0.0001108 debye
dipolederiv: -0.8359524 0.1451117 -0.0000254 0.1957793 -0.1613741 0.0000078 -0.0000273 0.0000063 -0.0694195 -0.7391254 0.120075 -0.0000249 -0.0286828 0.1130332 -0.0000163 -0.0000421 -0.0000167 -0.0161017 -1.0404914 -0.1794302 -0.0000135 -0.2150012 -0.6764201 0.0000121 0.0000153 0.000045 -0.0742333 -1.3233659 0.1516076 -0.0000387 0.2690839 -0.3781554 0.0000238 0.0000018 -0.0000063 -0.2053397 0.6538365 0.0852052 0.0000173 0.4110775 0.0907171 0.000008 -0.0000203 -0.0000068 0.0407121 0.5251868 0.109357 0.0000192 -0.4340264 -0.0838038 -0.0000023 0.0000213 0.0000098 0.063326 -0.3448791 0.0020845 -0.0000121 0.0178545 0.0282681 -0.0000038 -0.0000053 -0.0000042 -0.1047217 0.1309225 0.0200655 0.0000019 0.1295698 0.0898299 -0.000008 0.000009 -0.0000073 -0.1401589 1.8159241 -0.0830309 0.0000287 0.0103788 0.6519163 -0.000021 0.000043 -0.0000196 0.0105057 1.2211949 -0.2379758 0.0000449 -0.4421365 0.170456 -0.0000159 0.0000558 -0.0000164 -0.0719791 -0.4486621 0.0451714 -0.0000073 0.1377958 -0.0419555 -0.0000022 -0.0000239 -0.0000037 -0.1350928 0.1066009 -0.1507561 0.0000174 -0.1787716 0.1223804 -0.0000164 -0.0000042 -0.0000099 0.0607435 0.1005071 0.0147702 -0.0000023 0.0290345 0.0232595 0.0000053 -0.0000031 0.0000072 0.1794213 0.0704865 0.044788 -0.0000049 0.0212743 -0.0245511 0.0000092 -0.0000015 0.0000082 0.1832636 0.015927 -0.0728572 -0.0000013 -0.0535017 0.0462438 0.000004 -0.0000008 0.0000051 0.1729349 0.0990873 -0.00864 -0.0607547 0.0637334 -0.026737 -0.0739782 -0.0451164 -0.0561183 -0.0130439 -0.1062641 0.003084 -0.0000085 0.0027923 0.0836055 0.0000064 -0.0000136 0.0000056 0.1322485 0.0990668 -0.0086298 0.0607645 0.0637462 -0.0267126 0.0739874 0.0451124 0.0561218 -0.0130651 unknown
polarizability: 218.2272856|-2.019818|111.9584101|0.0041248|-0.0028889|49.7793213 unknown
InChI: InChI=1S/C8H6ClNOS/c1-12-8-10-6-4-5(9)2-3-7(6)11-8/h2-4H,1H3
charge 0 multiplicity 1
18 atoms
Cl 4.372116 -0.601123 0.000102
S  -3.631081 -0.874778 -0.000026
O  -1.428584 0.815719 -0.000106
N  -0.912283 -1.459535 -0.00003
C  0.294187 -0.705851 -0.000003
C  -0.011808 0.685299 -0.000053
C  1.637387 -1.134195 0.000036
C  0.953378 1.695425 -0.000075
C  -1.874097 -0.552157 0.000005
C  2.61074 -0.11669 0.000038
C  2.304246 1.267343 -0.000013
C  -4.302044 0.891118 -0.000244
H  1.901295 -2.193511 0.000071
H  0.695403 2.757119 -0.000128
H  3.113583 2.001913 -0.000023
H  -3.969404 1.419243 0.903478
H  -5.396206 0.775009 -0.000278
H  -3.969329 1.419052 -0.904052
