program: Gaussian 09
title: 000047551
version: EM64L-G09RevD.01
frameworkgroup: C1[X(C7H16N4)]
method: RPBEPBE
basis: SDD
operation: Freq
keyword: #pfreq=noraman
keyword: PBEPBE/SDD
title: #p freq=noraman PBEPBE/SDD
converged: YES YES NO NO
title: Mulliken charges:
elementType: N N N N C C C C C C C H H H H H H H H H H H H H H H H
charge: -0.110102 -0.574535 -0.546052 -0.020327 -0.339940 -0.354148 -0.369488 -0.394114 -0.401238 -0.422303 -0.154871 0.225057 0.199508 0.195699 0.193532 0.231439 0.220486 0.205917 0.202648 0.221462 0.207003 0.245070 0.264653 0.262894 0.280374 0.265172 0.266205
chargesum: 0.00000
title: Mulliken charges with hydrogens summed into heavy atoms:
elementType: N N N N C C C C C C C
charge: -0.110102 -0.031267 -0.014675 -0.020327 0.084625 0.035083 0.082436 0.014451 0.027227 0.087420 -0.154871
polarizability: 1.24315698e+02 1.31063076e+00 1.03861565e+02 4.86163184e-01 -8.30481465e-02 7.84021616e+01
1716.lowfreq: -9.1493 -0.0008 -0.0005 -0.0001 3.8430 5.2860 41.8691 48.3114 54.9700
frequency: 41.8549 48.2732 54.9654 66.7376 78.7359 92.3496 145.3909 183.3052 203.4742 221.4204 261.7733 271.5299 328.6827 335.8524 366.2534 383.6303 443.6916 513.4387 540.0818 559.9805 578.6773 757.5298 767.0410 784.6757 845.2517 934.0377 943.5149 961.4145 1005.8939 1016.7378 1040.2964 1051.8660 1079.8446 1093.2333 1107.7996 1111.0006 1165.5685 1229.7270 1235.7896 1252.2304 1274.5378 1283.4476 1287.7031 1297.5375 1313.7250 1329.5287 1347.7298 1362.7797 1370.1819 1385.6688 1443.4517 1456.2108 1470.3660 1473.6359 1479.6525 1488.2335 1643.4301 1643.6178 2194.6011 2863.2655 2904.8030 2906.2310 2924.9172 2993.5296 3003.2963 3004.7788 3012.1920 3035.9476 3046.6164 3059.3371 3069.2630 3467.2420 3475.3865 3594.1263 3602.6832
redmass: 5.4937 3.9062 3.6151 2.3537 1.8565 1.9706 4.8217 1.6837 1.4738 2.5736 2.0092 1.3681 2.8818 2.7283 3.4595 3.5477 3.7643 2.4649 3.1788 1.9329 1.3339 1.1305 1.2183 1.1375 4.2767 3.5438 1.5395 1.4778 2.7403 3.5166 2.7252 2.5751 2.3060 3.5434 1.7544 2.5987 1.3179 1.6360 2.0426 1.2508 1.3286 1.1266 1.2184 1.1871 1.2142 1.2807 1.3580 1.3085 1.3112 1.4131 1.0826 1.0797 1.0878 1.0774 1.0883 1.0863 1.0941 1.0914 12.4214 1.0697 1.0696 1.0697 1.0675 1.0648 1.0610 1.0840 1.0890 1.0960 1.0914 1.1043 1.1004 1.0445 1.0452 1.0982 1.0981
irintensity: 2.6895 2.2114 2.4578 4.1864 1.8654 3.4830 3.2266 16.9710 33.9124 7.0701 9.4145 46.3844 17.0828 4.9454 2.1805 5.8389 12.5956 28.4062 68.0762 303.7681 203.4903 4.5980 5.3049 5.6228 3.1122 4.7300 0.7770 3.6366 15.3337 1.0655 33.4552 10.5951 41.0763 38.6554 20.3307 22.9930 4.7236 16.8476 12.5270 9.7511 6.7206 2.6718 9.0056 12.0308 0.4607 0.9006 3.8031 11.1299 1.5928 2.9158 9.6217 1.6699 3.5686 7.8776 8.2522 6.6214 50.4228 26.3656 17.4696 83.8973 61.7266 16.7890 151.0297 29.8729 9.5789 36.1291 0.9338 67.1287 16.9479 54.5612 23.5654 0.9293 0.3948 0.7532 1.4492
temp: 298.150 k
press: 1.00000 atm
elementType: 7 7 7 7 6 6 6 6 6 6 6 1 1 1 1 1 1 1 1 1 1 1 1 1 1 1 1
symmnumber: 1
zpe: 613763.3 jmol-1
zpe.correction: 0.233770 hartree
zpe.thermalcorrener: 0.248062 hartree
zpe.thermalcorrenthalpy: 0.249006 hartree
zpe.thermalcorrgfe: 0.191288 hartree
zpe.sumelectzpe: -494.388656 hartree
zpe.sumelectthermal: -494.374364 hartree
zpe.sumelectthermalent: -494.373420 hartree
zpe.sumelectthermalfe: -494.431138 hartree
dipole: -4.0875 -0.0211 -0.0673
dipole: 4.0882
quadrupole: -95.8050 -61.9500 -69.4698
quadrupole: -5.1082 -4.8818 -8.3618
quadrupole: -20.0634 13.7916 6.2718 -5.1082 -4.8818 -8.3618
hfenergy: -494.6224256 hartree
pointgroup: C01 [X(C7H16N4)]
dipole: 1.6071038 -0.0557238 -0.0328661 debye
polarizability: 124.194394|-1.8898409|103.9393096|-1.2102062|0.7097517|78.4457209 unknown
InChI: InChI=1S/C7H16N4/c8-2-1-5-11(6-3-9)7-4-10/h1,3-7,9-10H2
charge 0 multiplicity 1
27 atoms
N  0.382191 -0.002326 -0.192721
N  2.193672 3.331866 0.076406
N  2.508563 -3.208724 0.042856
N  -4.541053 0.033778 0.118372
C  1.285415 1.115869 -0.562896
C  0.872181 -1.348527 -0.57261
C  -1.040107 0.244357 -0.494664
C  1.310355 2.232559 0.506845
C  1.946921 -1.897581 0.409936
C  -1.950934 -0.333389 0.631653
C  -3.384749 -0.139665 0.359311
H  1.019673 1.575494 -1.542252
H  2.310005 0.711014 -0.672658
H  1.289416 -1.36375 -1.611029
H  0.01581 -2.051942 -0.57408
H  -1.21177 1.333433 -0.559614
H  -1.352308 -0.188733 -1.473626
H  1.583397 1.767307 1.482505
H  0.289613 2.644277 0.625163
H  1.499784 -1.966118 1.418552
H  2.779652 -1.172896 0.489511
H  -1.753833 -1.415295 0.754183
H  -1.683181 0.151681 1.587953
H  3.190863 3.099842 0.070503
H  2.008917 4.23676 0.51509
H  3.048322 -3.218886 -0.827199
H  1.850784 -3.991205 0.099811
