program: Gaussian 09
title: 000047548
version: EM64L-G09RevD.01
frameworkgroup: C1[X(C12H18N2O2)]
method: RPBEPBE
basis: SDD
operation: Freq
keyword: #p
keyword: freq=noraman
keyword: PBEPBE/SDD
title: #p freq=noraman PBEPBE/SDD
converged: YES YES NO NO
title: Mulliken charges:
elementType: O O N N C C C C C C C C C C C C H H H H H H H H H H H H H H H H H H
charge: -0.283830 -0.286034 -0.280722 -0.552173 0.291898 -0.406487 -0.377230 -0.689107 0.201644 0.206715 -0.343231 -0.363396 -0.363993 -0.410973 -0.216138 -0.215911 0.230474 0.199064 0.211817 0.232865 0.240847 0.230833 0.227276 0.235872 0.170687 0.202905 0.248170 0.248575 0.228433 0.194815 0.227383 0.227503 0.264298 0.267155
chargesum: 0.00000
title: Mulliken charges with hydrogens summed into heavy atoms:
elementType: O O N N C C C C C C C C C C C C
charge: -0.283830 -0.286034 -0.044851 -0.020720 0.291898 0.023050 0.067451 0.009848 0.201644 0.206715 0.030361 -0.115226 -0.115419 0.012276 0.011244 0.011592
polarizability: 1.62122971e+02 -2.90837666e+01 1.51027566e+02 2.13930783e+00 1.80874539e+00 1.31585472e+02
1716.lowfreq: -8.1152 -2.2504 0.0006 0.0006 0.0009 6.6544 21.3814 32.1237 49.4979
frequency: 21.1166 32.0859 49.4137 71.8085 87.2294 120.9638 147.0250 157.4534 175.6989 203.6061 227.0110 259.9359 264.6464 268.2653 294.8102 337.5838 413.0458 415.6171 442.7138 460.8313 521.5960 549.7194 556.2315 581.6420 593.1591 646.6982 690.3937 705.2312 726.4956 730.2481 743.3536 778.3818 803.4389 808.7419 839.1146 842.6387 912.9865 933.0689 958.0631 958.6829 994.2820 1006.6800 1008.2142 1032.8817 1061.9966 1073.9751 1099.1483 1105.2138 1128.4437 1135.2404 1151.9867 1162.2492 1187.4882 1224.8816 1229.5052 1243.8704 1270.0315 1271.6518 1286.9212 1292.0075 1320.0024 1327.5842 1358.8065 1384.6193 1393.4103 1410.1464 1441.6272 1443.6749 1451.6753 1459.5753 1460.9048 1463.9264 1466.8540 1484.2225 1499.2892 1605.1219 1624.6544 1644.0204 2839.8185 2897.7356 2974.5580 2994.5173 2996.4677 3000.7484 3033.5050 3056.7048 3065.6663 3105.8930 3106.7067 3138.8521 3156.9439 3174.1498 3181.4798 3412.1629 3461.4387 3587.8226
redmass: 5.3302 4.4082 1.6445 4.0044 3.5152 1.8859 2.8340 3.7036 2.8417 1.0777 3.5994 1.1563 3.1265 4.3558 3.1901 4.1028 3.4193 3.2017 3.2127 3.0800 4.3074 4.1700 4.2739 1.6211 7.4601 5.0502 1.3024 4.8010 6.4345 4.1780 1.2251 1.1056 3.3805 1.8514 4.6245 1.3459 1.3760 1.7167 1.2827 1.2142 1.9765 2.4283 2.0234 2.4053 2.7415 3.3341 2.4794 1.7625 1.9494 2.1156 3.8911 1.1042 2.4602 2.3346 1.6757 2.9756 1.2515 1.4233 1.2384 1.1615 1.3116 1.3040 1.4131 1.2580 1.4761 4.8391 1.0819 2.4522 1.2093 1.0652 1.0537 1.0972 3.4018 1.0910 1.0811 7.8853 7.8937 1.0899 1.0710 1.0702 1.0683 1.0599 1.0833 1.0381 1.0876 1.1004 1.0998 1.1002 1.1004 1.0858 1.0918 1.0950 1.0992 1.0736 1.0445 1.0978
irintensity: 0.0468 0.2551 5.1978 2.7280 1.0789 5.0952 1.3999 0.4745 0.2958 0.2798 3.1183 50.0404 10.2050 4.6418 2.7046 0.2011 25.4970 1.2079 12.1483 0.2736 8.5070 0.1462 25.9164 336.1155 0.1342 0.2873 82.2058 2.8549 8.8587 9.6086 113.7843 1.3787 52.7592 30.6402 6.9237 0.2292 6.4293 9.8000 0.0048 1.8109 2.7471 16.8920 17.1450 14.0311 7.0704 42.6652 15.9397 22.7010 35.1508 55.4634 85.6447 21.1611 7.1810 256.2051 67.8072 22.4798 8.0556 1.3025 4.3463 0.6421 12.5342 12.4429 10.6951 36.1039 5.8358 11.1742 5.0683 3.3477 15.8332 4.2136 9.0816 9.5094 200.6783 3.9370 4.4205 1.4520 3.1324 32.6281 109.1461 83.6722 26.6571 13.3274 52.1596 16.5039 12.6206 44.1507 17.8133 17.9767 17.7204 2.2272 19.6412 11.7090 6.3889 2.3510 1.3045 0.3863
temp: 298.150 k
press: 1.00000 atm
elementType: 8 8 7 7 6 6 6 6 6 6 6 6 6 6 6 6 1 1 1 1 1 1 1 1 1 1 1 1 1 1 1 1 1 1
symmnumber: 1
zpe: 746007.4 jmol-1
zpe.correction: 0.284139 hartree
zpe.thermalcorrener: 0.300788 hartree
zpe.thermalcorrenthalpy: 0.301732 hartree
zpe.thermalcorrgfe: 0.238359 hartree
zpe.sumelectzpe: -726.763529 hartree
zpe.sumelectthermal: -726.746880 hartree
zpe.sumelectthermalent: -726.745936 hartree
zpe.sumelectthermalfe: -726.809310 hartree
dipole: 1.1121 -0.3682 0.5952
dipole: 1.3140
quadrupole: -109.6161 -86.7551 -92.9308
quadrupole: 1.1637 -1.5576 1.8197
quadrupole: -13.1821 9.6789 3.5032 1.1637 -1.5576 1.8197
hfenergy: -727.0476686 hartree
pointgroup: C01 [X(C12H18N2O2)]
dipole: -0.4347063 0.1518653 0.2349642 debye
polarizability: 161.5026803|-29.2237467|151.5858114|-2.0116777|-1.8379345|131.6475168 unknown
InChI: InChI=1S/C12H18N2O2/c1-12(6-8-14-9-7-13)15-10-4-2-3-5-11(10)16-12/h2-5,14H,6-9,13H2,1H3
charge 0 multiplicity 1
34 atoms
O  -1.225738 -0.85642 1.21247
O  -1.140991 -0.743649 -1.18939
N  2.977485 -0.583122 0.135367
N  6.217492 1.453622 -0.096482
C  -0.739047 -1.605681 -0.012314
C  0.784153 -1.718195 0.039709
C  1.517146 -0.363486 0.035272
C  -1.491827 -2.931048 -0.100258
C  -2.072977 0.168039 0.733842
C  -2.022411 0.234991 -0.677433
C  3.800551 0.635479 -0.014257
C  -2.855887 1.04726 1.486915
C  -2.751594 1.184144 -1.398699
C  5.314077 0.298024 0.04589
C  -3.607881 2.018118 0.766169
C  -3.556724 2.085203 -0.645518
H  1.128001 -2.317663 -0.822884
H  1.040053 -2.28684 0.956168
H  1.112123 0.281035 0.851558
H  1.31325 0.153742 -0.920088
H  -2.579742 -2.749625 -0.116677
H  -1.207711 -3.467529 -1.021527
H  -1.251405 -3.562655 0.772091
H  3.219693 -1.09036 0.999816
H  3.575588 1.419476 0.755711
H  3.571724 1.086539 -1.001067
H  -2.885892 0.988596 2.578196
H  -2.702726 1.228351 -2.48996
H  5.543911 -0.43606 -0.747492
H  5.539459 -0.201248 1.010411
H  -4.237231 2.722352 1.32014
H  -4.146743 2.840922 -1.174348
H  6.133534 2.153576 0.646918
H  6.212687 1.881413 -1.027047
