program: AMS
programVersion: 2021.106
runtype: GEOMETRY OPTIMIZATION
method: DFT
functional: Becke88 Perdew86
functional: VWN
spinMolecule: Restricted
epsl: 37.50000
solvent: Acetonitrile angstrom
formula: O19W6
InChI: InChI=1S/19O.6W
25 atoms
O  0.000000 0.000000 0.000000
W  2.377806 0.000000 0.000000
W  0.000000 2.377806 0.000000
W  -2.377806 0.000000 0.000000
W  0.000000 -2.377806 0.000000
W  0.000000 0.000000 2.377806
W  0.000000 0.000000 -2.377806
O  1.907544 1.907544 0.000000
O  -1.907544 1.907544 0.000000
O  -1.907544 -1.907544 0.000000
O  1.907544 -1.907544 0.000000
O  0.000000 1.907544 1.907544
O  0.000000 -1.907544 1.907544
O  0.000000 -1.907544 -1.907544
O  0.000000 1.907544 -1.907544
O  -1.907544 0.000000 1.907544
O  1.907544 0.000000 1.907544
O  1.907544 0.000000 -1.907544
O  -1.907544 0.000000 -1.907544
O  4.124714 0.000000 0.000000
O  -4.124714 0.000000 0.000000
O  0.000000 0.000000 4.124714
O  0.000000 0.000000 -4.124714
O  0.000000 4.124714 0.000000
O  0.000000 -4.124714 0.000000
elementType: O W W W W W W O O O O O O O O O O O O O O O O O O
mdcq: -0.61075556 1.96395736 1.96395736 1.96395736 1.96395735 1.96395741 1.96395740 -0.79972689 -0.79972689 -0.79972689 -0.79972689 -0.79972655 -0.79972655 -0.79972655 -0.79972656 -0.79972656 -0.79972656 -0.79972655 -0.79972655 -0.59604483 -0.59604483 -0.59604469 -0.59604469 -0.59604483 -0.59604483
eener: -188.875770 electronvolt
kinener: 165.064876 electronvolt
coulombener: -7.766472 electronvolt
xcener: -180.688032 electronvolt
solvener: -5.767048 electronvolt
dispener: 0.000000 electronvolt
total: -218.032437 electronvolt
charge: -1.26389638 2.48159033 2.48159033 2.48159033 2.48159033 2.48159033 2.48159033 -0.92417743 -0.92417743 -0.92417743 -0.92417743 -0.92417743 -0.92417743 -0.92417743 -0.92417743 -0.92417743 -0.92417743 -0.92417743 -0.92417743 -0.75591940 -0.75591940 -0.75591940 -0.75591940 -0.75591940 -0.75591940
dipole: -0.00000000 -0.00000000 0.00000000
dipole: 0.000000
quadrupole: -0.00000000 -0.00000000 -0.00000000 -0.00000000 0.00000000 0.00000000
charge: -2
converged: GEOMETRY CONVERGED
energy: -80.7202 -80.7164 -80.7142 -45.5910 -45.5327 -45.4812 -45.4300 -45.3607 -45.3539 -45.3016 -24.8631 -24.0079 -23.9761 -23.6376 -23.5084 -23.1843 -23.1640 -23.1556 -22.7772 -12.4096 -12.3866 -12.0025 -11.6923 -11.1878 -11.0040 -10.8543 -10.1337 -10.0105 -9.9677 -9.6891 -9.6517 -9.2418 -9.1174 -8.9406 -8.5974 -8.5779 -8.4826 -7.9283 -7.8326 -7.7225 -7.2767 -7.0268 -3.9000 -3.4774 -3.0713 -2.4164 -2.3876 -2.0264 -1.7492 -1.6719 -1.3283 0.0821 0.6313 0.9854 0.9965 1.2323 2.0279 2.8388 3.5258 3.7146 4.0238 4.1919 4.3654 5.0107 5.3905 5.7674 6.0245 6.1507 6.2695 7.3832 7.5344 7.6467 7.7965 8.0573 9.0742 9.5171 9.6352 10.1337 11.1700 11.2028 11.3002 12.6924 14.1113 15.2283 16.1712 16.7823 17.2425 17.2686 17.3179 18.4485 18.8850 19.0176 19.1066 19.4740 20.5642 21.0184 21.7175 22.9322 22.9331 24.7225 25.7553 25.9922 26.2819 26.3228 27.2844 27.5294 27.5331 27.7675 28.2950 28.8603 29.2712 29.3964 29.7865 30.8925 31.3727 31.5622 31.5977 31.9573 32.1579 33.0210 33.2533 33.9998 34.0938 35.2654 35.5492 36.1577 36.3522 36.5159 36.9720 37.1721 37.1987 37.6460 38.4761 38.7777 38.9991 39.8432 39.8545 40.0417 40.6305 41.2082 41.2172 43.2762 43.4204 45.0769 45.7688 46.0869 46.5391 46.8172 48.0070 50.1470 50.5060 51.5472 51.6820 52.1566 52.5139 53.9056 55.3308 55.4206 56.5976 56.9640 59.3498 60.8350 64.1250 64.7963 64.9625 65.5599 65.9116 70.5717 72.9502 73.5619 75.3745 75.4627 76.7728 80.5206 84.8631 84.8759 103.0764 103.0859 105.0652 120.1231 120.8773 124.7567 125.9020 126.7857 127.8177 128.0672 130.3279 130.5263 130.9049 132.6635 132.6759 133.8307 135.5487 135.7443 137.5716 142.7467 144.8364 145.0484 150.3620 153.6328 156.4182 156.7366 160.7929 160.8868 163.0216 164.0046 164.8235 168.7883 179.1972 913.6978 918.3162 921.7734 927.0150 931.8474 939.5001 952.3621 966.3293 988.5386 82899.4943 82929.3188 82939.2690 electronvolt
mo.energy: -24.863 electronvolt
energy: -24.141 -24.141 -24.141 -5.836 -9.204 1.301 -0.653 electronvolt
mo.energy: -24.008 electronvolt
energy: -24.141 -4.627 -4.627 -24.141 3.974 -5.836 electronvolt
mo.energy: -23.976 electronvolt
energy: -24.141 -24.141 -9.204 -5.836 -4.627 electronvolt
mo.energy: -23.638 electronvolt
energy: -24.141 -24.141 -24.141 -4.627 3.974 electronvolt
mo.energy: -23.508 electronvolt
energy: -24.141 -4.627 -0.653 electronvolt
mo.energy: -23.184 electronvolt
energy: -24.141 -4.627 -43.279 electronvolt
mo.energy: -23.164 electronvolt
energy: -24.141 -4.627 -0.653 -43.279 -24.141 -9.204 electronvolt
mo.energy: -23.156 electronvolt
energy: -24.141 -4.627 -24.141 -0.653 -43.279 -9.204 electronvolt
mo.energy: -22.777 electronvolt
energy: -24.141 -24.141 -0.653 -43.279 electronvolt
mo.energy: -12.410 electronvolt
energy: -9.204 -4.627 3.974 electronvolt
mo.energy: -12.387 electronvolt
energy: -9.204 -4.627 -4.627 3.974 1.301 electronvolt
mo.energy: -12.003 electronvolt
energy: -9.204 -9.204 -4.627 -4.627 -9.204 -9.204 -0.653 -9.204 -24.141 3.974 -9.204 -24.141 electronvolt
mo.energy: -11.692 electronvolt
energy: -9.204 -4.627 3.974 9.644 electronvolt
mo.energy: -11.188 electronvolt
energy: -9.204 -4.627 -9.204 -9.204 -4.627 -24.141 3.974 electronvolt
mo.energy: -11.004 electronvolt
energy: -9.204 -4.627 -9.204 3.974 -24.141 -9.204 electronvolt
mo.energy: -10.854 electronvolt
energy: -9.204 -9.204 -4.627 -9.204 -24.141 -4.627 3.974 1.301 -0.653 9.644 electronvolt
mo.energy: -10.134 electronvolt
energy: -9.204 -4.627 -9.204 -9.204 -4.627 3.974 -0.653 9.644 electronvolt
mo.energy: -10.010 electronvolt
energy: -9.204 -4.627 -9.204 -9.204 electronvolt
mo.energy: -9.968 electronvolt
energy: -9.204 -9.204 -4.627 -24.141 -24.141 -0.653 9.644 electronvolt
mo.energy: -9.689 electronvolt
energy: -9.204 -9.204 -9.204 -4.627 -4.627 -9.204 -9.204 -24.141 3.974 electronvolt
mo.energy: -9.652 electronvolt
energy: -9.204 -4.627 -24.141 -9.204 3.974 -9.204 electronvolt
mo.energy: -9.242 electronvolt
energy: -9.204 -4.627 -9.204 3.974 -0.653 electronvolt
mo.energy: -9.117 electronvolt
energy: -9.204 -9.204 3.974 -4.627 -24.141 -24.141 -0.653 electronvolt
mo.energy: -8.941 electronvolt
energy: -9.204 -9.204 -4.627 -0.653 20.489 -9.204 3.974 9.644 electronvolt
mo.energy: -8.597 electronvolt
energy: -9.204 -24.141 -4.627 -4.627 electronvolt
mo.energy: -8.578 electronvolt
energy: -9.204 -9.204 -9.204 -9.204 -0.653 -4.627 -9.204 -9.204 electronvolt
mo.energy: -8.483 electronvolt
energy: -9.204 -4.627 electronvolt
mo.energy: -7.928 electronvolt
energy: -9.204 -9.204 -9.204 -0.653 -9.204 -9.204 electronvolt
mo.energy: -7.833 electronvolt
energy: -9.204 -9.204 -9.204 electronvolt
mo.energy: -7.722 electronvolt
energy: -9.204 -9.204 electronvolt
mo.energy: -7.277 electronvolt
energy: -9.204 -9.204 -9.204 -9.204 -9.204 -9.204 9.644 electronvolt
mo.energy: -7.027 electronvolt
energy: -9.204 -9.204 9.644 9.644 electronvolt
mo.energy: -3.900 electronvolt
energy: -4.627 -9.204 9.644 3.974 28.861 electronvolt
mo.energy: -3.477 electronvolt
energy: -4.627 -9.204 3.974 -0.653 9.644 electronvolt
mo.energy: -3.071 electronvolt
energy: -4.627 -9.204 3.974 9.644 -9.204 electronvolt
mo.energy: -2.416 electronvolt
energy: -4.627 -9.204 -9.204 3.974 -9.204 9.644 electronvolt
mo.energy: -2.388 electronvolt
energy: -4.627 -9.204 -9.204 3.974 9.644 -4.627 3.974 electronvolt
mo.energy: -2.026 electronvolt
energy: -4.627 -9.204 3.974 9.644 electronvolt
mo.energy: -1.749 electronvolt
energy: -4.627 -9.204 -9.204 3.974 9.644 electronvolt
mo.energy: -1.672 electronvolt
energy: -4.627 -9.204 -0.653 -5.836 -24.141 -24.141 28.861 24.443 24.443 9.644 20.489 electronvolt
mo.energy: -1.328 electronvolt
energy: -4.627 -4.627 -24.141 -0.653 -9.204 -9.204 24.443 28.861 3.974 -5.836 electronvolt
mo.energy: 0.082 electronvolt
energy: 1.301 -5.836 24.443 24.443 -4.627 24.443 3.974 -9.204 -24.141 -24.141 electronvolt
mo.energy: 0.631 electronvolt
energy: -5.836 1.301 -4.627 -9.204 -0.653 9.644 -9.204 -0.653 -9.204 -24.141 24.443 -9.204 electronvolt
mo.energy: 0.985 electronvolt
energy: -4.627 -9.204 3.974 -24.141 -0.653 -9.204 24.443 9.644 9.644 electronvolt
mo.energy: 0.997 electronvolt
energy: -5.836 -4.627 -4.627 1.301 -9.204 -9.204 -0.653 24.443 -24.141 9.644 28.861 24.443 electronvolt
mo.energy: 1.232 electronvolt
energy: -4.627 1.301 -5.836 -9.204 -9.204 -9.204 9.644 3.974 -24.141 24.443 -0.653 -9.204 9.644 -0.653 electronvolt
