program: AMS
programVersion: 2021.106
runtype: GEOMETRY OPTIMIZATION
method: DFT
functional: Becke88 Perdew86
functional: VWN
spinMolecule: Restricted
epsl: 78.39000
solvent: Water angstrom
formula: Li4O32W10
InChI: InChI=1S/4Li.32O.10W
46 atoms
W  2.367562 -0.007619 1.996187
W  -2.389534 -0.005536 1.986607
W  2.373812 -0.008464 -1.984980
W  -2.382180 -0.005995 -1.992055
W  -0.008079 2.370582 1.989517
W  -0.010465 -2.385087 1.990358
W  -0.003788 2.370605 -1.990200
W  -0.006472 -2.386289 -1.988010
W  -0.014269 -0.005945 4.346484
W  -0.001762 -0.008610 -4.344761
O  -0.007342 -0.005538 1.994389
O  -0.006507 -0.006833 -1.992503
O  1.914439 1.914626 1.859202
O  -1.930407 1.915771 1.853878
O  1.911652 -1.929642 1.858417
O  -1.932314 -1.926961 1.854925
O  1.918134 1.913656 -1.854829
O  -1.926320 1.916308 -1.858252
O  1.915333 -1.930197 -1.852156
O  -1.928418 -1.928669 -1.857399
O  -0.010827 1.897830 3.864810
O  -0.012880 -1.909959 3.864710
O  -0.001936 1.896119 -3.864362
O  -0.003956 -1.912509 -3.862575
O  -0.005883 2.332934 -0.000166
O  -0.010260 -2.347560 0.001304
O  1.892201 -0.007611 3.869003
O  -1.916732 -0.005127 3.861927
O  1.900948 -0.009470 -3.860481
O  -1.906854 -0.007025 -3.866102
O  2.334713 -0.007292 0.003573
O  -2.347681 -0.005831 -0.002093
O  4.094980 -0.009255 2.183508
O  -4.117047 -0.004941 2.170479
O  4.101214 -0.010111 -2.171038
O  -4.109506 -0.005219 -2.180131
O  -0.016859 -0.006082 6.088968
O  0.000391 -0.009325 -6.087239
O  -0.008219 4.098091 2.175616
O  -0.011854 -4.112358 2.177361
O  -0.002893 4.098048 -2.176476
O  -0.006974 -4.113739 -2.173454
Li -2.344092 -2.341724 -0.003651
Li 2.331255 -2.337398 0.002388
Li -2.336221 2.331307 -0.004348
Li 2.330258 2.319296 0.001189
elementType: W W W W W W W W W W O O O O O O O O O O O O O O O O O O O O O O O O O O O O O O O O Li Li Li Li
mdcq: 1.91600899 1.91659344 1.91603252 1.91620620 1.91611376 1.91647907 1.91618211 1.91643432 1.96874053 1.96873383 -0.65639543 -0.65622999 -0.72355047 -0.72377475 -0.72380482 -0.72377343 -0.72373844 -0.72384581 -0.72399951 -0.72390000 -0.75232816 -0.75244372 -0.75224921 -0.75228753 -0.73297821 -0.73351178 -0.75175155 -0.75219627 -0.75249967 -0.75228967 -0.73293443 -0.73348278 -0.54217422 -0.54185729 -0.54198978 -0.54231230 -0.55225781 -0.55249781 -0.54222786 -0.54206785 -0.54213419 -0.54206122 0.55796594 0.55722044 0.55694017 0.55589462
eener: -342.321210 electronvolt
kinener: 264.067572 electronvolt
coulombener: 12.285491 electronvolt
xcener: -296.880134 electronvolt
solvener: -1.748332 electronvolt
dispener: 0.000000 electronvolt
total: -364.596621 electronvolt
charge: 2.58089879 2.58118439 2.58077557 2.58125040 2.58098651 2.58135778 2.58076583 2.58113197 2.53670930 2.53669863 -1.17229314 -1.17221612 -1.03226698 -1.03247577 -1.03262235 -1.03242537 -1.03263614 -1.03269402 -1.03294649 -1.03270068 -0.90538941 -0.90553221 -0.90538263 -0.90547772 -1.06239927 -1.06164134 -0.90514943 -0.90556519 -0.90564719 -0.90540183 -1.06335611 -1.06179915 -0.68997163 -0.68987818 -0.68994736 -0.69007910 -0.72141313 -0.72158368 -0.69000949 -0.68994251 -0.69003799 -0.68997569 0.83474170 0.83479058 0.83471373 0.83485210
dipole: 0.00002492 -0.01537513 0.01036066
dipole: 0.018540
quadrupole: 35.88262374 -0.00681620 0.05201936 35.74182385 -0.03596253 -71.62444758
charge: 0
converged: GEOMETRY CONVERGED
charge: 2.5809 2.5812 2.5808 2.5813 2.5810 2.5814 2.5808 2.5811 2.5367 2.5367 -1.1723 -1.1722 -1.0323 -1.0325 -1.0326 -1.0324 -1.0326 -1.0327 -1.0329 -1.0327 -0.9054 -0.9055 -0.9054 -0.9055 -1.0624 -1.0616 -0.9051 -0.9056 -0.9056 -0.9054 -1.0634 -1.0618 -0.6900 -0.6899 -0.6899 -0.6901 -0.7214 -0.7216 -0.6900 -0.6899 -0.6900 -0.6900 0.8347 0.8348 0.8347 0.8349
mo.energy: -25.730 electronvolt
energy: -24.141 -24.141 -24.141 -24.141 -24.141 -24.141 -24.141 -24.141 -24.141 -24.141 -24.141 -24.141 -24.141 -24.141 -24.141 -24.141 -24.141 -24.141 -24.141 -24.141 -24.141 -24.141 electronvolt
mo.energy: -25.572 electronvolt
energy: -24.141 -24.141 -24.141 -24.141 -24.141 -24.141 -24.141 -24.141 -24.141 -24.141 -24.141 -24.141 -24.141 -24.141 -24.141 -24.141 -24.141 -24.141 electronvolt
mo.energy: -25.166 electronvolt
energy: -24.141 -24.141 -24.141 -24.141 -24.141 -24.141 -24.141 -24.141 -24.141 -24.141 -24.141 -24.141 -24.141 -24.141 electronvolt
mo.energy: -25.112 electronvolt
energy: -24.141 -24.141 -24.141 -24.141 -24.141 -24.141 -24.141 -24.141 -24.141 -24.141 -24.141 -24.141 -24.141 -24.141 -24.141 -24.141 electronvolt
mo.energy: -25.081 electronvolt
mo.energy: -24.999 electronvolt
energy: -24.141 -24.141 -24.141 -24.141 -24.141 -24.141 -24.141 -24.141 -24.141 -24.141 -24.141 -24.141 -24.141 -24.141 -24.141 -24.141 -4.627 -4.627 -24.141 -24.141 -24.141 -24.141 electronvolt
energy: -24.141 -24.141 -24.141 -24.141 -24.141 -24.141 -24.141 -24.141 -24.141 -24.141 electronvolt
mo.energy: -24.704 electronvolt
energy: -24.141 -24.141 -24.141 -24.141 -24.141 -24.141 -24.141 -24.141 -4.627 -4.627 electronvolt
mo.energy: -24.684 electronvolt
energy: -24.141 -24.141 -24.141 -24.141 -24.141 -24.141 -24.141 -24.141 -24.141 -24.141 -24.141 -24.141 -24.141 -24.141 -24.141 -24.141 -4.627 -4.627 -4.627 -4.627 electronvolt
mo.energy: -24.683 electronvolt
mo.energy: -24.459 electronvolt
energy: -24.141 -24.141 -24.141 -24.141 -24.141 -24.141 -24.141 -24.141 electronvolt
mo.energy: -24.450 electronvolt
mo.energy: -24.398 electronvolt
energy: -24.141 -24.141 -24.141 -24.141 electronvolt
mo.energy: -24.397 electronvolt
mo.energy: -24.345 electronvolt
mo.energy: -24.173 electronvolt
energy: -24.141 -24.141 -24.141 -24.141 -24.141 -24.141 -24.141 -4.627 -4.627 -4.627 -4.627 -24.141 -24.141 -24.141 -24.141 -24.141 -24.141 -24.141 -24.141 -4.627 electronvolt
mo.energy: -24.172 electronvolt
energy: -24.141 -24.141 -24.141 -24.141 -24.141 -24.141 -24.141 -4.627 -4.627 -4.627 -4.627 -24.141 -24.141 -24.141 -24.141 -24.141 -24.141 -4.627 -24.141 -24.141 electronvolt
mo.energy: -24.135 electronvolt
energy: -24.141 -24.141 -24.141 -24.141 -24.141 -24.141 -24.141 -24.141 -24.141 -24.141 -24.141 -24.141 -4.627 -4.627 electronvolt
mo.energy: -24.004 electronvolt
energy: -24.141 -24.141 -24.141 -24.141 -24.141 -24.141 electronvolt
mo.energy: -23.950 electronvolt
energy: -24.141 -24.141 -24.141 -24.141 -24.141 -4.627 -24.141 -4.627 -4.627 electronvolt
mo.energy: -23.949 electronvolt
energy: -24.141 -24.141 -24.141 -24.141 -4.627 -4.627 -4.627 -4.627 electronvolt
mo.energy: -23.947 electronvolt
energy: -24.141 -24.141 -24.141 -24.141 -24.141 -4.627 -4.627 -4.627 -24.141 electronvolt
mo.energy: -23.946 electronvolt
energy: -24.141 -24.141 -24.141 -24.141 -24.141 -24.141 -24.141 -4.627 -4.627 electronvolt
mo.energy: -23.945 electronvolt
energy: -24.141 -24.141 -24.141 -24.141 -24.141 -4.627 -4.627 electronvolt
mo.energy: -23.941 electronvolt
mo.energy: -23.719 electronvolt
energy: -24.141 -24.141 -4.627 -4.627 -24.141 -24.141 -24.141 -24.141 -24.141 -24.141 -24.141 -24.141 -24.141 -24.141 electronvolt
mo.energy: -23.713 electronvolt
mo.energy: -23.166 electronvolt
energy: -24.141 -24.141 -24.141 -24.141 -24.141 -24.141 -24.141 -24.141 -24.141 -24.141 -24.141 -24.141 electronvolt
mo.energy: -23.158 electronvolt
mo.energy: -13.617 electronvolt
energy: -9.204 -9.204 -9.204 -9.204 -9.204 -9.204 -9.204 -9.204 -9.204 -9.204 -9.204 -9.204 -4.627 -4.627 -4.627 -4.627 -4.627 -4.627 -4.627 -4.627 -9.204 -9.204 -9.204 -9.204 -9.204 -9.204 -9.204 -9.204 -4.627 -4.627 electronvolt
mo.energy: -13.560 electronvolt
energy: -9.204 -9.204 -9.204 -9.204 -4.627 -4.627 -9.204 -9.204 -9.204 -9.204 -9.204 -9.204 -9.204 -9.204 -9.204 -9.204 -9.204 -9.204 -9.204 -9.204 -9.204 -9.204 -4.627 -4.627 -4.627 -4.627 -4.627 -4.627 -4.627 -4.627 electronvolt
mo.energy: -13.433 electronvolt
energy: -9.204 -9.204 -9.204 -9.204 -9.204 -9.204 -9.204 -9.204 -9.204 -9.204 -9.204 -9.204 -9.204 -9.204 -9.204 -9.204 -4.627 -4.627 -4.627 -4.627 -4.627 -4.627 -4.627 -4.627 electronvolt
mo.energy: -13.403 electronvolt
mo.energy: -13.061 electronvolt
energy: -9.204 -9.204 -4.627 -4.627 -4.627 -4.627 -9.204 -9.204 -9.204 -9.204 -9.204 -9.204 -9.204 -9.204 -9.204 -9.204 3.974 3.974 3.974 3.974 electronvolt
mo.energy: -12.849 electronvolt
mo.energy: -12.642 electronvolt
energy: -4.627 -4.627 -9.204 -9.204 -9.204 -9.204 -9.204 -9.204 -9.204 -9.204 -9.204 -9.204 -9.204 -9.204 -9.204 -9.204 -9.204 -9.204 -9.204 -9.204 electronvolt
mo.energy: -12.611 electronvolt
energy: -4.627 -4.627 -9.204 -9.204 -9.204 -9.204 -9.204 -9.204 -9.204 -9.204 -4.627 -4.627 -9.204 -4.627 -4.627 -9.204 -9.204 -9.204 -9.204 -9.204 3.974 3.974 -9.204 -9.204 electronvolt
energy: -9.204 -9.204 -9.204 -9.204 -9.204 -9.204 -9.204 -9.204 -9.204 -9.204 -9.204 -9.204 -4.627 -4.627 -4.627 -4.627 -9.204 -9.204 -9.204 -9.204 -4.627 -4.627 -9.204 -9.204 -9.204 -9.204 -9.204 -9.204 -4.627 -4.627 -4.627 -4.627 -4.627 -4.627 -4.627 -4.627 electronvolt
mo.energy: -12.610 electronvolt
energy: -9.204 -9.204 -9.204 -9.204 -4.627 -4.627 -9.204 -9.204 -9.204 -9.204 -9.204 -9.204 -9.204 -9.204 -4.627 -4.627 -4.627 -4.627 -9.204 -9.204 -9.204 -9.204 -4.627 -4.627 -4.627 -4.627 -9.204 -9.204 -9.204 -9.204 -4.627 -4.627 -4.627 -4.627 -9.204 -9.204 -9.204 -9.204 electronvolt
mo.energy: -12.505 electronvolt
energy: -9.204 -9.204 -9.204 -9.204 -4.627 -4.627 -9.204 -9.204 -9.204 -9.204 -9.204 -9.204 -4.627 -4.627 -9.204 -9.204 -4.627 -4.627 -9.204 -9.204 -9.204 -9.204 -9.204 -9.204 -4.627 -4.627 electronvolt
energy: -9.204 -9.204 -9.204 -9.204 -4.627 -4.627 -9.204 -9.204 -9.204 -9.204 -9.204 -9.204 -4.627 -4.627 -9.204 -9.204 -9.204 -9.204 -4.627 -9.204 -4.627 -9.204 -9.204 -9.204 -4.627 -4.627 electronvolt
mo.energy: -12.482 electronvolt
energy: -4.627 -4.627 -9.204 -9.204 -9.204 -9.204 -9.204 -9.204 -9.204 -9.204 -9.204 -9.204 -9.204 -9.204 -9.204 -9.204 -9.204 -9.204 -4.627 -4.627 -4.627 -4.627 -4.627 -4.627 -4.627 -4.627 -4.627 -4.627 -4.627 -4.627 -4.627 -4.627 -4.627 -4.627 electronvolt
mo.energy: -12.479 electronvolt
energy: -9.204 -9.204 -9.204 -9.204 -9.204 -9.204 -9.204 -9.204 -9.204 -9.204 -4.627 -4.627 -4.627 -4.627 -9.204 -9.204 -9.204 -9.204 -4.627 -4.627 -4.627 -4.627 -9.204 -9.204 -9.204 -9.204 electronvolt
mo.energy: -12.196 electronvolt
energy: -9.204 -9.204 -9.204 -9.204 -9.204 -9.204 -9.204 -9.204 -9.204 -9.204 -4.627 -4.627 -4.627 -4.627 -4.627 -4.627 -4.627 -4.627 -9.204 -9.204 -9.204 -9.204 -9.204 -9.204 -9.204 -9.204 -9.204 -9.204 -9.204 -9.204 electronvolt
mo.energy: -12.160 electronvolt
energy: -9.204 -9.204 -9.204 -9.204 -9.204 -9.204 -9.204 -9.204 -4.627 -4.627 -4.627 -4.627 -9.204 -9.204 -9.204 -9.204 -9.204 -9.204 -9.204 -9.204 electronvolt
mo.energy: -12.159 electronvolt
mo.energy: -11.981 electronvolt
energy: -4.627 -4.627 -4.627 -4.627 -4.627 -4.627 -4.627 -4.627 -9.204 -9.204 -9.204 -9.204 -9.204 -9.204 -9.204 -9.204 -9.204 -9.204 -9.204 -9.204 -9.204 -9.204 -9.204 -9.204 -9.204 -9.204 -9.204 -9.204 -9.204 -9.204 -9.204 -9.204 -9.204 -9.204 electronvolt
mo.energy: -11.933 electronvolt
energy: -9.204 -9.204 -4.627 -4.627 -9.204 -9.204 -9.204 -9.204 -9.204 -9.204 -9.204 -9.204 -9.204 -9.204 -4.627 -4.627 -4.627 -4.627 -4.627 -4.627 -4.627 -4.627 -0.653 -0.653 -9.204 -9.204 -9.204 -9.204 electronvolt
mo.energy: -11.833 electronvolt
energy: -9.204 -9.204 -4.627 -4.627 -4.627 -4.627 -9.204 -9.204 -9.204 -9.204 -9.204 -9.204 -9.204 -9.204 -9.204 -9.204 -9.204 -9.204 -9.204 -9.204 -4.627 -4.627 -4.627 -9.204 -4.627 -4.627 -4.627 -9.204 -9.204 electronvolt
energy: -9.204 -9.204 -4.627 -4.627 -4.627 -4.627 -9.204 -9.204 -9.204 -9.204 -9.204 -9.204 -9.204 -9.204 -9.204 -9.204 -9.204 -9.204 -9.204 -9.204 -4.627 -4.627 -4.627 -4.627 -4.627 -9.204 -4.627 -9.204 -9.204 -9.204 electronvolt
mo.energy: -11.779 electronvolt
energy: -4.627 -4.627 -4.627 -4.627 -4.627 -4.627 -4.627 -4.627 -9.204 -9.204 -9.204 -9.204 -9.204 -9.204 -9.204 -9.204 -9.204 -9.204 -9.204 -9.204 -9.204 -9.204 -9.204 -9.204 -9.204 -9.204 -9.204 -9.204 -9.204 -9.204 -9.204 -9.204 -4.627 -4.627 -9.204 -9.204 -9.204 -9.204 -9.204 -9.204 -9.204 -9.204 -4.627 -4.627 -4.627 -4.627 -4.627 -4.627 -4.627 -4.627 electronvolt
mo.energy: -11.416 electronvolt
energy: -4.627 -4.627 -4.627 -4.627 -4.627 -4.627 -9.204 -9.204 -9.204 -9.204 -9.204 -9.204 -4.627 -4.627 -4.627 -4.627 -9.204 -9.204 -9.204 -9.204 -9.204 -9.204 -9.204 -9.204 -9.204 -9.204 -9.204 -9.204 -4.627 -4.627 -9.204 -9.204 -4.627 -9.204 -9.204 -4.627 -9.204 -9.204 -9.204 -9.204 -9.204 -9.204 -9.204 -9.204 -9.204 electronvolt
mo.energy: -11.415 electronvolt
energy: -4.627 -4.627 -4.627 -4.627 -4.627 -4.627 -9.204 -9.204 -9.204 -9.204 -9.204 -9.204 -4.627 -4.627 -4.627 -4.627 -9.204 -9.204 -9.204 -9.204 -9.204 -9.204 -9.204 -9.204 -9.204 -9.204 -9.204 -9.204 -4.627 -4.627 -4.627 -4.627 -9.204 -9.204 -9.204 -9.204 -9.204 -9.204 -9.204 -9.204 -9.204 -9.204 -9.204 -9.204 -9.204 electronvolt
mo.energy: -11.256 electronvolt
energy: -9.204 -9.204 -9.204 -9.204 -9.204 -9.204 -9.204 -9.204 -9.204 -9.204 -9.204 -9.204 -9.204 -9.204 -9.204 -9.204 -9.204 -9.204 -4.627 -4.627 electronvolt
mo.energy: -11.251 electronvolt
energy: -9.204 -9.204 -9.204 -9.204 -9.204 -9.204 -4.627 -4.627 -4.627 -4.627 -4.627 -4.627 -9.204 -4.627 -4.627 -9.204 -9.204 -9.204 -9.204 -9.204 -9.204 -9.204 -4.627 -4.627 -9.204 -9.204 -9.204 -9.204 -9.204 -9.204 -9.204 -9.204 -9.204 -9.204 -9.204 -9.204 -9.204 -9.204 -9.204 -9.204 -9.204 -9.204 electronvolt
energy: -9.204 -9.204 -9.204 -9.204 -9.204 -9.204 -4.627 -4.627 -4.627 -4.627 -4.627 -4.627 -9.204 -9.204 -9.204 -9.204 -9.204 -9.204 -9.204 -9.204 -9.204 -4.627 -9.204 -4.627 -4.627 -9.204 -9.204 -9.204 -9.204 -9.204 -9.204 -9.204 -4.627 -9.204 -9.204 -9.204 -9.204 -9.204 -9.204 -9.204 electronvolt
mo.energy: -11.196 electronvolt
energy: -9.204 -9.204 -9.204 -9.204 -4.627 -4.627 -9.204 -9.204 -9.204 -9.204 -9.204 -9.204 -9.204 -9.204 3.974 3.974 electronvolt
mo.energy: -11.161 electronvolt
energy: -9.204 -9.204 -9.204 -9.204 -4.627 -4.627 -4.627 -4.627 -4.627 -4.627 -4.627 -4.627 -9.204 -9.204 -9.204 -9.204 -9.204 -9.204 -9.204 -9.204 -9.204 -9.204 -9.204 -9.204 -9.204 -9.204 -9.204 -9.204 electronvolt
mo.energy: -11.135 electronvolt
energy: -9.204 -9.204 -9.204 -9.204 -9.204 -9.204 -9.204 -9.204 -9.204 -9.204 -9.204 -9.204 -9.204 -9.204 -9.204 -9.204 -9.204 -9.204 -9.204 -9.204 -4.627 -4.627 -4.627 -4.627 -4.627 -4.627 -4.627 -4.627 electronvolt
mo.energy: -10.967 electronvolt
energy: -9.204 -9.204 -9.204 -9.204 -9.204 -9.204 -9.204 -9.204 -4.627 -4.627 -4.627 -4.627 -4.627 -4.627 -4.627 -4.627 -9.204 -9.204 -9.204 -9.204 electronvolt
mo.energy: -10.966 electronvolt
mo.energy: -10.859 electronvolt
energy: -9.204 -9.204 -9.204 -9.204 -4.627 -4.627 -4.627 -4.627 -9.204 -9.204 -9.204 -9.204 -9.204 -9.204 -9.204 -9.204 -9.204 -9.204 -9.204 -9.204 -4.627 -4.627 -9.204 -9.204 -9.204 -9.204 -9.204 -9.204 -9.204 -9.204 -9.204 -9.204 -9.204 electronvolt
mo.energy: -10.858 electronvolt
energy: -9.204 -9.204 -9.204 -9.204 -9.204 -9.204 -4.627 -4.627 -4.627 -4.627 -9.204 -9.204 -9.204 -9.204 -9.204 -9.204 -9.204 -9.204 -9.204 -9.204 -4.627 -4.627 -9.204 -9.204 -9.204 -9.204 -9.204 -9.204 -9.204 -9.204 -9.204 -9.204 -9.204 electronvolt
mo.energy: -10.839 electronvolt
energy: -4.627 -4.627 -9.204 -9.204 -9.204 -9.204 -9.204 -9.204 -9.204 -9.204 -9.204 -9.204 -9.204 -9.204 electronvolt
mo.energy: -10.691 electronvolt
energy: -9.204 -9.204 -9.204 -9.204 -9.204 -9.204 -9.204 -9.204 -9.204 -9.204 -9.204 -9.204 -9.204 -9.204 -4.627 -9.204 -9.204 -4.627 -9.204 -9.204 -9.204 -9.204 -9.204 -9.204 -9.204 -9.204 -9.204 -9.204 -9.204 -9.204 -9.204 -9.204 -24.141 -24.141 electronvolt
mo.energy: -10.567 electronvolt
energy: -9.204 -9.204 -9.204 -9.204 -9.204 -9.204 -9.204 -9.204 -9.204 -9.204 -9.204 -9.204 -9.204 -9.204 -9.204 -9.204 -9.204 -9.204 -4.627 -4.627 -4.627 -4.627 -9.204 -9.204 -9.204 -9.204 -4.627 -4.627 -9.204 -9.204 -9.204 electronvolt
mo.energy: -10.566 electronvolt
energy: -9.204 -9.204 -9.204 -9.204 -9.204 -9.204 -9.204 -9.204 -9.204 -9.204 -9.204 -9.204 -4.627 -4.627 -4.627 -9.204 -4.627 -9.204 -9.204 -9.204 -9.204 -9.204 -9.204 -9.204 -4.627 -4.627 -9.204 -9.204 -9.204 -9.204 -9.204 -9.204 -9.204 -9.204 -9.204 -9.204 -4.627 -4.627 -4.627 -4.627 electronvolt
mo.energy: -10.565 electronvolt
energy: -9.204 -9.204 -9.204 -9.204 -9.204 -9.204 -9.204 -9.204 -9.204 -9.204 -9.204 -9.204 -9.204 -9.204 -9.204 -9.204 -9.204 -9.204 -9.204 -4.627 -9.204 -4.627 -9.204 -9.204 -9.204 -9.204 -4.627 -4.627 -9.204 -9.204 -9.204 -9.204 electronvolt
mo.energy: -10.526 electronvolt
energy: -9.204 -9.204 -9.204 -9.204 -9.204 -9.204 -9.204 -9.204 -4.627 -4.627 -4.627 -4.627 -9.204 -9.204 -9.204 -9.204 -9.204 -9.204 -9.204 -9.204 -9.204 -9.204 electronvolt
mo.energy: -10.455 electronvolt
energy: -9.204 -9.204 -9.204 -9.204 -9.204 -9.204 -9.204 -9.204 -4.627 -4.627 -4.627 -4.627 -4.627 -4.627 -4.627 -4.627 -9.204 -9.204 -9.204 -9.204 -9.204 -9.204 -9.204 -9.204 -9.204 -9.204 -9.204 -9.204 electronvolt
mo.energy: -10.363 electronvolt
energy: -9.204 -9.204 -9.204 -9.204 -9.204 -9.204 -9.204 -9.204 -4.627 -4.627 -4.627 -4.627 electronvolt
mo.energy: -10.357 electronvolt
energy: -9.204 -9.204 -4.627 -4.627 -9.204 -9.204 -9.204 -9.204 -9.204 -9.204 -9.204 -9.204 -9.204 -9.204 -9.204 -9.204 -24.141 -9.204 -24.141 -9.204 -9.204 -9.204 -9.204 -9.204 -9.204 -9.204 -9.204 -9.204 electronvolt
mo.energy: -10.349 electronvolt
mo.energy: -10.330 electronvolt
energy: -4.627 -4.627 -9.204 -9.204 -9.204 -9.204 -9.204 -9.204 -9.204 -9.204 -9.204 -9.204 -9.204 -9.204 -9.204 -9.204 -9.204 -9.204 -9.204 -9.204 -9.204 -9.204 electronvolt
mo.energy: -10.290 electronvolt
energy: -9.204 -9.204 -4.627 -4.627 -9.204 -9.204 -9.204 -9.204 -9.204 -9.204 -9.204 -9.204 -9.204 -9.204 -9.204 -9.204 -9.204 -9.204 -9.204 -9.204 -9.204 -9.204 -9.204 -9.204 -9.204 -9.204 -9.204 -9.204 -9.204 -9.204 -9.204 -9.204 -9.204 -9.204 -9.204 -9.204 electronvolt
mo.energy: -10.234 electronvolt
energy: -9.204 -9.204 -9.204 -9.204 -9.204 -9.204 -9.204 -9.204 -9.204 -9.204 -9.204 -9.204 -9.204 -9.204 -9.204 -9.204 -9.204 -9.204 -9.204 -9.204 -9.204 -9.204 -9.204 -9.204 -9.204 -9.204 -9.204 -9.204 -9.204 -9.204 -9.204 -9.204 -9.204 -9.204 electronvolt
mo.energy: -10.219 electronvolt
energy: -9.204 -9.204 -9.204 -9.204 -9.204 -9.204 -9.204 -9.204 -9.204 -9.204 -9.204 -9.204 -9.204 -9.204 -9.204 -9.204 -9.204 -9.204 -9.204 -9.204 -9.204 -9.204 -9.204 -9.204 electronvolt
mo.energy: -10.133 electronvolt
energy: -4.627 -4.627 -9.204 -9.204 -9.204 -9.204 -9.204 -9.204 -9.204 -9.204 -9.204 -9.204 -9.204 -9.204 -9.204 -9.204 -9.204 -9.204 electronvolt
mo.energy: -10.081 electronvolt
energy: -9.204 -9.204 -9.204 -9.204 -9.204 -9.204 -9.204 -9.204 -4.627 -9.204 -9.204 -4.627 -9.204 -9.204 -9.204 -9.204 -9.204 -9.204 -9.204 -9.204 -9.204 -9.204 -9.204 -9.204 -9.204 -9.204 -9.204 -9.204 electronvolt
mo.energy: -10.053 electronvolt
energy: -9.204 -9.204 -9.204 -9.204 -9.204 -9.204 -9.204 -9.204 -4.627 -4.627 -4.627 -4.627 -4.627 -4.627 -4.627 -4.627 electronvolt
mo.energy: -9.993 electronvolt
energy: -9.204 -9.204 -9.204 -9.204 -9.204 -9.204 -9.204 -9.204 -4.627 -4.627 -4.627 -4.627 -4.627 -4.627 -4.627 -4.627 -9.204 -9.204 -9.204 -9.204 -9.204 -9.204 -9.204 -9.204 -9.204 -9.204 -9.204 -9.204 -9.204 -9.204 -9.204 -9.204 electronvolt
mo.energy: -9.962 electronvolt
energy: -9.204 -9.204 -9.204 -9.204 -9.204 -9.204 -9.204 -9.204 -9.204 -9.204 -9.204 -9.204 -4.627 -4.627 -9.204 -9.204 -9.204 -9.204 -4.627 -4.627 -4.627 -4.627 -9.204 -9.204 -9.204 -9.204 electronvolt
mo.energy: -9.961 electronvolt
mo.energy: -9.844 electronvolt
energy: -9.204 -9.204 -9.204 -9.204 -9.204 -9.204 -9.204 -9.204 -9.204 -9.204 -9.204 -9.204 -9.204 -9.204 -9.204 -9.204 -4.627 -4.627 -9.204 -9.204 -9.204 -9.204 -4.627 -4.627 -4.627 -4.627 electronvolt
mo.energy: -9.843 electronvolt
mo.energy: -9.582 electronvolt
energy: -9.204 -9.204 -9.204 -9.204 -9.204 -9.204 -9.204 -9.204 -9.204 -9.204 -9.204 -9.204 -9.204 -9.204 -9.204 -9.204 -9.204 -9.204 -9.204 -9.204 -9.204 -9.204 electronvolt
mo.energy: -9.492 electronvolt
energy: -9.204 -9.204 -9.204 -9.204 -9.204 -9.204 -9.204 -9.204 -9.204 -9.204 -9.204 -9.204 -9.204 -9.204 -9.204 -9.204 -9.204 -9.204 -9.204 -9.204 -9.204 -9.204 -9.204 -9.204 -9.204 -9.204 -9.204 -9.204 -4.627 -4.627 -4.627 -4.627 -4.627 -4.627 -4.627 -4.627 electronvolt
mo.energy: -9.464 electronvolt
energy: -9.204 -9.204 -9.204 -9.204 -9.204 -9.204 -9.204 -9.204 -9.204 -9.204 -9.204 -9.204 -9.204 -9.204 -4.627 -4.627 electronvolt
mo.energy: -9.380 electronvolt
energy: -9.204 -9.204 -9.204 -9.204 -9.204 -9.204 -9.204 -9.204 -9.204 -9.204 -9.204 -9.204 -9.204 -9.204 -9.204 -9.204 -9.204 -9.204 -9.204 -9.204 -9.204 -9.204 -9.204 -9.204 -9.204 -9.204 -9.204 -9.204 -9.204 -9.204 -9.204 -9.204 -9.204 -9.204 -9.204 -9.204 -9.204 -9.204 -9.204 -9.204 -9.204 -9.204 -9.204 -9.204 -9.204 -9.204 -9.204 -9.204 -9.204 -9.204 -9.204 -9.204 -9.204 -9.204 -9.204 -9.204 electronvolt
mo.energy: -9.219 electronvolt
energy: -9.204 -9.204 -9.204 -9.204 -9.204 -9.204 -9.204 -9.204 -9.204 -9.204 -9.204 -9.204 -9.204 -9.204 -9.204 -9.204 -9.204 -9.204 -9.204 -9.204 -9.204 -9.204 -9.204 -9.204 -9.204 -9.204 electronvolt
mo.energy: -9.112 electronvolt
energy: -9.204 -9.204 -9.204 -9.204 -9.204 -9.204 -9.204 -9.204 -9.204 -9.204 -9.204 -9.204 -9.204 -9.204 -9.204 -9.204 -9.204 -9.204 -9.204 -9.204 -9.204 -9.204 -9.204 -9.204 -9.204 -9.204 -9.204 -9.204 -9.204 -9.204 electronvolt
mo.energy: -9.099 electronvolt
energy: -9.204 -9.204 -9.204 -9.204 -9.204 -9.204 -9.204 -9.204 -9.204 -9.204 -9.204 -9.204 -9.204 -9.204 -9.204 -9.204 -9.204 -9.204 -9.204 -9.204 -9.204 -9.204 -9.204 electronvolt
mo.energy: -9.043 electronvolt
mo.energy: -8.923 electronvolt
energy: -9.204 -9.204 -9.204 -9.204 -9.204 -9.204 -9.204 -9.204 -9.204 -9.204 -9.204 -9.204 -9.204 -9.204 -9.204 -9.204 -9.204 -9.204 -9.204 -9.204 -9.204 -9.204 -9.204 -9.204 -9.204 -9.204 -9.204 -9.204 -9.204 -9.204 -9.204 -9.204 electronvolt
mo.energy: -8.847 electronvolt
energy: -9.204 -9.204 -9.204 -9.204 -9.204 -9.204 -9.204 -9.204 -9.204 -9.204 -9.204 -9.204 -9.204 -9.204 -9.204 -9.204 -9.204 -9.204 -9.204 -9.204 electronvolt
mo.energy: -8.820 electronvolt
energy: -9.204 -9.204 -9.204 -9.204 -9.204 -9.204 -9.204 -9.204 -9.204 -9.204 -9.204 -9.204 -9.204 -9.204 -9.204 -9.204 -9.204 -9.204 -9.204 -9.204 -9.204 -9.204 -9.204 -9.204 -9.204 -9.204 -9.204 -9.204 -9.204 -9.204 -9.204 -9.204 -9.204 -9.204 -9.204 -9.204 -4.627 -4.627 electronvolt
mo.energy: -8.773 electronvolt
mo.energy: -8.772 electronvolt
mo.energy: -8.751 electronvolt
mo.energy: -8.662 electronvolt
mo.energy: -8.636 electronvolt
energy: -9.204 -9.204 -9.204 -9.204 -9.204 -9.204 -9.204 -9.204 -9.204 -9.204 -9.204 -9.204 -9.204 -9.204 -9.204 -9.204 -9.204 -9.204 -9.204 -9.204 -9.204 -9.204 -9.204 -9.204 -9.204 -9.204 -9.204 -9.204 -9.204 -9.204 -9.204 -9.204 -9.204 -9.204 -9.204 -9.204 -9.204 -9.204 -9.204 -9.204 -9.204 -9.204 -9.204 -9.204 electronvolt
mo.energy: -8.559 electronvolt
mo.energy: -8.415 electronvolt
mo.energy: -8.414 electronvolt
mo.energy: -8.357 electronvolt
mo.energy: -8.290 electronvolt
energy: -9.204 -9.204 -9.204 -9.204 -9.204 -9.204 -9.204 -9.204 -9.204 -9.204 -9.204 -9.204 electronvolt
mo.energy: -8.188 electronvolt
energy: -9.204 -9.204 -9.204 -9.204 -9.204 -9.204 -9.204 -9.204 -9.204 -9.204 -9.204 -9.204 -9.204 -9.204 -9.204 electronvolt
energy: -9.204 -9.204 -9.204 -9.204 -9.204 -9.204 -9.204 -9.204 -9.204 -9.204 -9.204 -9.204 -9.204 -9.204 electronvolt
mo.energy: -8.173 electronvolt
mo.energy: -8.146 electronvolt
mo.energy: -8.015 electronvolt
mo.energy: -8.014 electronvolt
mo.energy: -7.960 electronvolt
mo.energy: -7.959 electronvolt
mo.energy: -7.780 electronvolt
energy: -9.204 -9.204 -9.204 -9.204 -9.204 -9.204 -9.204 -9.204 -9.204 -9.204 -9.204 -9.204 -9.204 -9.204 -9.204 -9.204 -9.204 -9.204 electronvolt
mo.energy: -7.701 electronvolt
energy: -9.204 -9.204 -9.204 -9.204 -9.204 -9.204 -9.204 -9.204 electronvolt
mo.energy: -5.378 electronvolt
energy: -4.627 -4.627 -4.627 -4.627 -4.627 -4.627 -4.627 -4.627 -9.204 -9.204 -9.204 -9.204 -9.204 -9.204 -9.204 -9.204 electronvolt
mo.energy: -5.029 electronvolt
energy: -4.627 -4.627 -4.627 -4.627 -4.627 -4.627 -4.627 -4.627 -4.627 -4.627 -9.204 -9.204 -9.204 -9.204 -9.204 -9.204 -9.204 -9.204 electronvolt
mo.energy: -4.978 electronvolt
energy: -4.627 -4.627 -4.627 -4.627 -9.204 -9.204 -9.204 -9.204 -9.204 -9.204 -9.204 -9.204 -9.204 -9.204 -9.204 -9.204 electronvolt
mo.energy: -4.977 electronvolt
mo.energy: -4.881 electronvolt
energy: -4.627 -4.627 -4.627 -4.627 -4.627 -4.627 -4.627 -4.627 -4.627 -4.627 -9.204 -9.204 -9.204 -9.204 -9.204 -9.204 -9.204 -9.204 -9.204 -9.204 -9.204 -9.204 -9.204 -9.204 -9.204 -9.204 electronvolt
mo.energy: -4.348 electronvolt
energy: -4.627 -4.627 -4.627 -4.627 -4.627 -4.627 -4.627 -4.627 -9.204 -9.204 -9.204 -9.204 -9.204 -9.204 -9.204 -9.204 -9.204 -9.204 -9.204 -9.204 electronvolt
mo.energy: -4.189 electronvolt
energy: -4.627 -4.627 -4.627 -4.627 -9.204 -9.204 -9.204 -9.204 -9.204 -9.204 -4.627 -4.627 -4.627 -4.627 electronvolt
mo.energy: -4.188 electronvolt
mo.energy: -4.040 electronvolt
energy: -4.627 -4.627 -4.627 -4.627 -9.204 -9.204 -9.204 -9.204 -4.627 -4.627 -9.204 -9.204 electronvolt
mo.energy: -4.039 electronvolt
mo.energy: -3.924 electronvolt
mo.energy: -3.910 electronvolt
mo.energy: -3.763 electronvolt
energy: -4.627 -4.627 -4.627 -4.627 -4.627 -4.627 -4.627 -4.627 -9.204 -9.204 -9.204 -9.204 -9.204 -9.204 -9.204 -9.204 -9.204 -9.204 electronvolt
mo.energy: -3.748 electronvolt
mo.energy: -3.529 electronvolt
energy: -4.627 -4.627 -4.627 -4.627 -4.627 -4.627 -9.204 -9.204 -9.204 -9.204 -9.204 -9.204 -9.204 -9.204 electronvolt
mo.energy: -3.528 electronvolt
mo.energy: -3.495 electronvolt
energy: -4.627 -4.627 -4.627 -4.627 -4.627 -4.627 -4.627 -4.627 -4.627 -4.627 -9.204 -9.204 -9.204 -9.204 -9.204 -9.204 -9.204 -9.204 3.974 3.974 electronvolt
mo.energy: -3.492 electronvolt
energy: -4.627 -4.627 -4.627 -4.627 -4.627 -4.627 -4.627 -4.627 -4.627 -4.627 -9.204 -9.204 -9.204 -9.204 -9.204 -9.204 -9.204 -9.204 -4.627 -4.627 -4.627 -4.627 -4.627 -4.627 -4.627 -4.627 -9.204 -9.204 -9.204 -9.204 electronvolt
mo.energy: -3.330 electronvolt
energy: -4.627 -4.627 -4.627 -4.627 -9.204 -9.204 -9.204 -9.204 -9.204 -9.204 -9.204 -4.627 -9.204 -4.627 -4.627 -4.627 -4.627 -4.627 -4.627 -4.627 electronvolt
mo.energy: -3.329 electronvolt
energy: -4.627 -4.627 -4.627 -4.627 -9.204 -9.204 -9.204 -9.204 -9.204 -9.204 -4.627 -9.204 -9.204 -4.627 -4.627 -4.627 -4.627 -4.627 -4.627 -4.627 electronvolt
mo.energy: -3.319 electronvolt
energy: -4.627 -4.627 -4.627 -4.627 -4.627 -4.627 -4.627 -4.627 -9.204 -9.204 -9.204 -9.204 -9.204 -9.204 -9.204 -9.204 -9.204 -9.204 -9.204 -9.204 -9.204 -9.204 -4.627 -4.627 -4.627 -4.627 -4.627 -4.627 -4.627 -4.627 electronvolt
mo.energy: -3.311 electronvolt
mo.energy: -3.169 electronvolt
energy: -4.627 -4.627 -4.627 -4.627 -4.627 -4.627 -4.627 -4.627 -4.627 -4.627 -4.627 -4.627 -4.627 -4.627 -9.204 -9.204 -4.627 -9.204 -9.204 -9.204 -9.204 -9.204 -9.204 -4.627 -4.627 -4.627 electronvolt
mo.energy: -2.841 electronvolt
energy: -4.627 -4.627 -9.204 -9.204 -9.204 -9.204 -9.204 -9.204 -4.627 -4.627 3.974 -4.627 -4.627 -9.204 -9.204 3.974 -9.204 -9.204 electronvolt
mo.energy: -2.839 electronvolt
energy: -4.627 -4.627 -9.204 -9.204 -9.204 -9.204 -9.204 -9.204 -4.627 -4.627 -4.627 -4.627 3.974 3.974 -9.204 -9.204 -9.204 -9.204 electronvolt
mo.energy: -2.800 electronvolt
energy: -4.627 -4.627 -9.204 -9.204 -9.204 -9.204 -4.627 -4.627 -9.204 -9.204 -4.627 -4.627 -4.627 -4.627 -4.627 -4.627 -9.204 -9.204 -9.204 -9.204 electronvolt
mo.energy: -2.799 electronvolt
energy: -4.627 -4.627 -9.204 -9.204 -9.204 -9.204 -9.204 -9.204 -4.627 -4.627 -4.627 -4.627 -4.627 -4.627 -4.627 -4.627 -9.204 -9.204 electronvolt
mo.energy: -2.776 electronvolt
energy: -4.627 -4.627 -4.627 -4.627 -4.627 -4.627 -4.627 -4.627 -9.204 -9.204 -9.204 -9.204 -9.204 -9.204 -9.204 -9.204 -9.204 -9.204 -9.204 -9.204 -9.204 -9.204 -9.204 -9.204 -9.204 -9.204 -9.204 -9.204 -9.204 -9.204 -9.204 -9.204 electronvolt
mo.energy: -2.740 electronvolt
energy: -4.627 -4.627 -4.627 -4.627 -4.627 -4.627 -4.627 -4.627 -4.627 -4.627 -4.627 -4.627 -4.627 -4.627 -4.627 -4.627 -4.627 -4.627 -9.204 -9.204 -9.204 -9.204 -9.204 -9.204 -9.204 -9.204 -9.204 -9.204 -9.204 -9.204 -9.204 -9.204 -9.204 -9.204 -9.204 -9.204 -9.204 -9.204 -9.204 -9.204 -9.204 -9.204 electronvolt
mo.energy: -2.484 electronvolt
energy: -4.627 -4.627 -4.627 -4.627 -4.627 -4.627 -4.627 -4.627 -4.627 -4.627 -4.627 -4.627 -4.627 -4.627 -4.627 -4.627 electronvolt
mo.energy: -2.431 electronvolt
energy: -4.627 -4.627 -4.627 -4.627 -4.627 -4.627 -4.627 -4.627 -9.204 -9.204 -9.204 -9.204 -9.204 -9.204 -9.204 -9.204 -0.653 -0.653 -0.653 -0.653 -0.653 -0.653 -0.653 -0.653 electronvolt
mo.energy: -1.549 electronvolt
energy: -4.627 -4.627 -0.653 -4.627 -0.653 -4.627 -4.627 -4.627 -4.627 -4.627 -4.627 -4.627 -9.204 -9.204 -5.836 -5.836 -4.627 -4.627 -4.627 -4.627 -4.627 -4.627 -4.627 -4.627 electronvolt
mo.energy: -1.300 electronvolt
energy: -4.627 -4.627 -4.627 -4.627 -4.627 -4.627 -4.627 -4.627 -4.627 -4.627 -4.627 -4.627 -4.627 -4.627 -4.627 -4.627 -4.627 -4.627 -9.204 -9.204 -9.204 -9.204 electronvolt
mo.energy: -0.993 electronvolt
energy: -4.627 -4.627 -0.653 -0.653 -9.204 -9.204 -4.627 -4.627 -4.627 -4.627 -4.627 -4.627 -4.627 -4.627 -5.836 -5.836 -9.204 -9.204 -9.204 -9.204 -9.204 -9.204 electronvolt
mo.energy: -0.861 electronvolt
energy: -4.627 -4.627 -4.627 -4.627 -4.627 -4.627 -4.627 -4.627 -4.627 -4.627 -9.204 -9.204 -9.204 -9.204 -9.204 -9.204 -9.204 -9.204 -9.204 -9.204 -9.204 -9.204 electronvolt
mo.energy: -0.802 electronvolt
energy: -2.960 -2.960 -2.960 -2.960 0.693 0.693 0.693 0.693 -5.836 -5.836 1.301 1.301 1.301 1.301 1.301 1.301 1.301 1.301 1.301 1.301 electronvolt
mo.energy: -0.624 electronvolt
energy: -2.960 -2.960 -4.627 -4.627 -4.627 -4.627 -4.627 -4.627 -4.627 -4.627 -4.627 -4.627 -4.627 -4.627 -4.627 -4.627 -4.627 -4.627 -9.204 -9.204 -9.204 -9.204 -9.204 -9.204 -9.204 -9.204 electronvolt
mo.energy: -0.269 electronvolt
energy: -2.960 -2.960 -4.627 -4.627 -4.627 -4.627 -2.960 -2.960 -5.836 -5.836 -5.836 -5.836 -9.204 -9.204 -9.204 -9.204 0.693 0.693 -1.064 -24.141 -1.064 -24.141 -1.064 -1.064 -4.627 -4.627 24.443 -4.627 24.443 -4.627 electronvolt
mo.energy: -0.267 electronvolt
energy: -2.960 -2.960 -4.627 -4.627 -4.627 -4.627 -2.960 -2.960 -5.836 -5.836 -5.836 -5.836 -9.204 -9.204 -9.204 -9.204 0.693 0.693 -1.064 -24.141 -1.064 -24.141 -1.064 -1.064 -4.627 -4.627 -4.627 24.443 24.443 -4.627 electronvolt
mo.energy: -0.169 electronvolt
energy: -4.627 -4.627 -4.627 -4.627 -5.836 -5.836 -5.836 -5.836 -9.204 -9.204 -9.204 -9.204 -9.204 -9.204 -9.204 -9.204 -9.204 -9.204 -4.627 -4.627 -4.627 -4.627 -9.204 -9.204 -9.204 -9.204 -4.627 -9.204 -4.627 -9.204 -9.204 -9.204 -4.627 -4.627 electronvolt
mo.energy: -0.168 electronvolt
energy: -4.627 -4.627 -4.627 -4.627 -5.836 -5.836 -5.836 -5.836 -9.204 -9.204 -9.204 -9.204 -9.204 -9.204 -9.204 -9.204 -9.204 -9.204 -4.627 -4.627 -4.627 -4.627 -9.204 -9.204 -9.204 -9.204 -4.627 -4.627 -9.204 -9.204 -9.204 -9.204 -4.627 -4.627 electronvolt
mo.energy: 0.029 electronvolt
energy: 1.301 1.301 -5.836 -5.836 -5.836 -5.836 -5.836 -5.836 -5.836 -5.836 -5.836 -5.836 -1.064 -1.064 -1.064 -1.064 1.301 1.301 1.301 1.301 1.301 1.301 1.301 1.301 -4.627 -4.627 electronvolt
