program: AMS
programVersion: 2021.106
runtype: GEOMETRY OPTIMIZATION
method: DFT
functional: B3LYP == Not Default ==
spinMolecule: Restricted
formula: O32W10
InChI: InChI=1S/32O.10W
42 atoms
W  2.352697 -0.000000 1.916746
W  -2.352697 0.000000 1.916746
W  2.352697 -0.000000 -1.916746
W  -2.352697 0.000000 -1.916746
W  0.000000 2.352697 1.916746
W  -0.000000 -2.352697 1.916746
W  0.000000 2.352697 -1.916746
W  -0.000000 -2.352697 -1.916746
W  -0.000000 -0.000000 4.280102
W  -0.000000 -0.000000 -4.280102
O  -0.000000 0.000000 1.960874
O  0.000000 0.000000 -1.960874
O  1.872740 1.872740 1.893439
O  -1.872740 1.872740 1.893439
O  1.872740 -1.872740 1.893439
O  -1.872740 -1.872740 1.893439
O  1.872740 1.872740 -1.893439
O  -1.872740 1.872740 -1.893439
O  1.872740 -1.872740 -1.893439
O  -1.872740 -1.872740 -1.893439
O  0.000000 1.873995 3.819450
O  -0.000000 -1.873995 3.819450
O  0.000000 1.873995 -3.819450
O  -0.000000 -1.873995 -3.819450
O  0.000000 2.321550 0.000000
O  -0.000000 -2.321550 0.000000
O  1.873995 -0.000000 3.819450
O  -1.873995 0.000000 3.819450
O  1.873995 -0.000000 -3.819450
O  -1.873995 0.000000 -3.819450
O  2.321550 -0.000000 0.000000
O  -2.321550 0.000000 0.000000
O  4.057206 0.000000 2.170635
O  -4.057206 -0.000000 2.170635
O  4.057206 0.000000 -2.170635
O  -4.057206 -0.000000 -2.170635
O  -0.000000 -0.000000 6.018637
O  -0.000000 -0.000000 -6.018637
O  -0.000000 4.057206 2.170635
O  0.000000 -4.057206 2.170635
O  -0.000000 4.057206 -2.170635
O  0.000000 -4.057206 -2.170635
elementType: W W W W W W W W W W O O O O O O O O O O O O O O O O O O O O O O O O O O O O O O O O
mdcq: 2.10378063 2.10378069 2.10378066 2.10378061 2.10378063 2.10378065 2.10378063 2.10378062 2.08930438 2.08930440 -0.63335378 -0.63335378 -0.84538737 -0.84538737 -0.84538737 -0.84538738 -0.84538737 -0.84538738 -0.84538738 -0.84538738 -0.85713122 -0.85713123 -0.85713122 -0.85713123 -0.80525082 -0.80525082 -0.85713122 -0.85713123 -0.85713122 -0.85713123 -0.80525082 -0.80525082 -0.67877526 -0.67877526 -0.67877527 -0.67877527 -0.73539608 -0.73539608 -0.67877527 -0.67877526 -0.67877526 -0.67877526
eener: -340.721938 electronvolt
kinener: 479.611043 electronvolt
coulombener: -153.224102 electronvolt
xcener: -415.426016 electronvolt
dispener: 0.000000 electronvolt
total: -429.761013 electronvolt
charge: 2.72295226 2.72295226 2.72295226 2.72295226 2.72295226 2.72295226 2.72295226 2.72295226 2.65112643 2.65112643 -1.31429524 -1.31429524 -1.02397485 -1.02397485 -1.02397485 -1.02397485 -1.02397485 -1.02397485 -1.02397485 -1.02397485 -1.00530457 -1.00530457 -1.00530457 -1.00530457 -1.03482033 -1.03482033 -1.00530457 -1.00530457 -1.00530457 -1.00530457 -1.03482033 -1.03482033 -0.79930675 -0.79930675 -0.79930675 -0.79930675 -0.84465493 -0.84465493 -0.79930675 -0.79930675 -0.79930675 -0.79930675
dipole: -0.00000000 -0.00000000 0.00000000
dipole: 0.000000
quadrupole: 48.40544571 0.00000000 -0.00000000 48.40544571 0.00000000 -96.81089143
charge: -4
converged: GEOMETRY CONVERGED
charge: 2.7230 2.7230 2.7230 2.7230 2.7230 2.7230 2.7230 2.7230 2.6511 2.6511 -1.3143 -1.3143 -1.0240 -1.0240 -1.0240 -1.0240 -1.0240 -1.0240 -1.0240 -1.0240 -1.0053 -1.0053 -1.0053 -1.0053 -1.0348 -1.0348 -1.0053 -1.0053 -1.0053 -1.0053 -1.0348 -1.0348 -0.7993 -0.7993 -0.7993 -0.7993 -0.8447 -0.8447 -0.7993 -0.7993 -0.7993 -0.7993
mo.energy: -16.720 electronvolt
energy: -26.457 -26.457 -26.457 -26.457 -6.253 -4.333 -26.457 -6.253 -9.818 electronvolt
mo.energy: -16.209 electronvolt
energy: -26.457 -26.457 -26.457 -26.457 -6.253 -4.333 electronvolt
mo.energy: -16.178 electronvolt
energy: -26.457 -26.457 -4.333 -26.457 -4.333 -26.457 4.567 electronvolt
mo.energy: -16.147 electronvolt
energy: -26.457 -26.457 -4.333 -4.333 -26.457 electronvolt
mo.energy: -16.109 electronvolt
energy: -26.457 -26.457 -4.333 -26.457 -4.333 -6.253 -9.818 electronvolt
mo.energy: -15.942 electronvolt
energy: -26.457 -26.457 -26.457 -6.253 -4.333 -4.333 -9.818 -4.333 electronvolt
mo.energy: -15.751 electronvolt
energy: -26.457 -4.333 -4.333 -26.457 0.043 electronvolt
mo.energy: -15.721 electronvolt
energy: -26.457 -26.457 -26.457 -4.333 -4.333 electronvolt
mo.energy: -15.549 electronvolt
energy: -26.457 -26.457 -26.457 -26.457 -4.333 -4.333 -26.457 -4.333 electronvolt
mo.energy: -15.490 electronvolt
energy: -26.457 -26.457 -4.333 -26.457 -26.457 -26.457 -4.333 -4.333 4.567 electronvolt
mo.energy: -15.445 electronvolt
energy: -26.457 -26.457 -26.457 -26.457 -4.333 -26.457 electronvolt
mo.energy: -15.314 electronvolt
mo.energy: -15.269 electronvolt
energy: -26.457 -26.457 -4.333 -26.457 -45.645 electronvolt
mo.energy: -15.259 electronvolt
energy: -26.457 -4.333 -4.333 -45.645 -26.457 electronvolt
mo.energy: -15.249 electronvolt
energy: -26.457 -4.333 -26.457 -45.645 -4.333 electronvolt
mo.energy: -15.233 electronvolt
energy: -26.457 0.043 -4.333 -45.645 electronvolt
mo.energy: -15.230 electronvolt
energy: -26.457 -26.457 -4.333 -4.333 -45.645 electronvolt
mo.energy: -15.214 electronvolt
energy: -26.457 -4.333 0.043 -45.645 electronvolt
mo.energy: -15.181 electronvolt
energy: -26.457 -26.457 -26.457 -4.333 -4.333 -45.645 electronvolt
mo.energy: -15.112 electronvolt
energy: -26.457 -26.457 -4.333 -26.457 -26.457 -45.645 electronvolt
mo.energy: -15.087 electronvolt
energy: -26.457 -26.457 -4.333 -26.457 -26.457 -45.645 -26.457 electronvolt
mo.energy: -14.958 electronvolt
energy: -26.457 -26.457 0.043 -45.645 electronvolt
mo.energy: -14.490 electronvolt
energy: -26.457 -26.457 -26.457 0.043 -26.457 electronvolt
mo.energy: -14.481 electronvolt
mo.energy: -4.003 electronvolt
energy: -9.818 -4.333 -9.818 -9.818 -4.333 -9.818 4.567 -4.333 4.567 electronvolt
mo.energy: -4.001 electronvolt
energy: -9.818 -9.818 -4.333 -9.818 4.567 -4.333 -6.253 -6.253 1.543 1.543 electronvolt
mo.energy: -3.821 electronvolt
energy: -9.818 -4.333 -4.333 4.567 1.543 4.567 electronvolt
mo.energy: -3.776 electronvolt
energy: -9.818 -4.333 4.567 -9.818 -6.253 -9.818 1.543 -9.818 -4.333 15.889 electronvolt
mo.energy: -3.432 electronvolt
energy: -9.818 -4.333 -9.818 -9.818 4.567 -6.253 -26.457 electronvolt
mo.energy: -2.963 electronvolt
energy: -9.818 -4.333 -4.333 -9.818 -9.818 -9.818 -9.818 -4.333 -9.818 0.043 4.567 -9.818 4.567 4.567 electronvolt
mo.energy: -2.951 electronvolt
energy: -9.818 -9.818 -4.333 -4.333 -9.818 -9.818 -4.333 -9.818 -9.818 -9.818 0.043 -4.333 -9.818 -26.457 -9.818 -9.818 -4.333 4.567 electronvolt
mo.energy: -2.946 electronvolt
energy: -4.333 -9.818 -9.818 -9.818 -4.333 4.567 -4.333 4.567 -9.818 electronvolt
mo.energy: -2.914 electronvolt
energy: -9.818 -9.818 -4.333 -9.818 -4.333 -4.333 -9.818 -9.818 -9.818 -9.818 -9.818 -9.818 -4.333 -26.457 -9.818 -26.457 0.043 electronvolt
mo.energy: -2.816 electronvolt
energy: -9.818 -9.818 -4.333 -4.333 4.567 -9.818 electronvolt
mo.energy: -2.500 electronvolt
energy: -9.818 -9.818 -4.333 -9.818 -4.333 -4.333 -9.818 4.567 4.567 -26.457 electronvolt
mo.energy: -2.461 electronvolt
energy: -9.818 -4.333 -9.818 -9.818 -9.818 4.567 -4.333 -9.818 -26.457 1.543 10.337 electronvolt
mo.energy: -2.361 electronvolt
energy: -9.818 -9.818 -9.818 -4.333 -9.818 -4.333 -9.818 -4.333 -9.818 -9.818 -9.818 -4.333 -9.818 -9.818 4.567 4.567 4.567 -9.818 electronvolt
mo.energy: -2.255 electronvolt
energy: -9.818 -4.333 -9.818 -26.457 -4.333 -9.818 -9.818 4.567 electronvolt
mo.energy: -2.221 electronvolt
energy: -9.818 -9.818 -4.333 -9.818 -4.333 -9.818 -9.818 -9.818 -9.818 0.043 4.567 -26.457 -9.818 4.567 electronvolt
mo.energy: -2.132 electronvolt
energy: -9.818 -4.333 -9.818 -9.818 -9.818 -4.333 -4.333 electronvolt
mo.energy: -2.112 electronvolt
energy: -9.818 -4.333 -9.818 -4.333 -4.333 -9.818 -9.818 -9.818 -4.333 -26.457 -9.818 4.567 -9.818 -9.818 4.567 -4.333 -9.818 -9.818 electronvolt
mo.energy: -2.105 electronvolt
energy: -9.818 -9.818 -4.333 4.567 -26.457 -4.333 -9.818 -9.818 0.043 -4.333 -6.253 electronvolt
mo.energy: -1.697 electronvolt
energy: -4.333 -9.818 -4.333 -9.818 -9.818 -9.818 -9.818 -9.818 -4.333 -9.818 -4.333 -9.818 -9.818 -9.818 -9.818 electronvolt
mo.energy: -1.506 electronvolt
energy: -4.333 -9.818 -9.818 -9.818 -9.818 -9.818 4.567 electronvolt
energy: -9.818 -4.333 -9.818 -4.333 -9.818 -9.818 -9.818 -9.818 -9.818 -9.818 -4.333 -9.818 4.567 -9.818 electronvolt
mo.energy: -1.423 electronvolt
energy: -9.818 -9.818 -4.333 -9.818 4.567 -26.457 -9.818 -4.333 0.043 -4.333 4.567 electronvolt
mo.energy: -1.362 electronvolt
energy: -9.818 -9.818 -9.818 -4.333 -4.333 -26.457 0.043 4.567 -9.818 -9.818 electronvolt
mo.energy: -1.087 electronvolt
energy: -9.818 -9.818 -9.818 -9.818 -9.818 -4.333 -4.333 -9.818 4.567 -9.818 -4.333 -9.818 electronvolt
mo.energy: -1.050 electronvolt
energy: -9.818 -9.818 -9.818 -4.333 -9.818 -4.333 -26.457 -4.333 -26.457 -9.818 -4.333 -9.818 0.043 -9.818 -26.457 electronvolt
mo.energy: -0.950 electronvolt
energy: -9.818 -4.333 -9.818 -26.457 -9.818 -4.333 4.567 -26.457 -9.818 electronvolt
mo.energy: -0.935 electronvolt
energy: -9.818 -9.818 -9.818 -9.818 -4.333 -9.818 -4.333 -9.818 -9.818 -4.333 -9.818 electronvolt
mo.energy: -0.908 electronvolt
energy: -9.818 -9.818 -9.818 -4.333 -9.818 -9.818 -9.818 -26.457 -4.333 -4.333 -9.818 electronvolt
mo.energy: -0.814 electronvolt
energy: -9.818 -9.818 -4.333 -9.818 -4.333 -9.818 0.043 4.567 electronvolt
mo.energy: -0.801 electronvolt
energy: -9.818 -9.818 -9.818 -9.818 -9.818 -4.333 -9.818 -4.333 -9.818 -4.333 -26.457 -26.457 4.567 4.567 electronvolt
mo.energy: -0.797 electronvolt
energy: -9.818 -9.818 -4.333 -26.457 -4.333 -9.818 -9.818 4.567 4.567 electronvolt
mo.energy: -0.788 electronvolt
energy: -9.818 -9.818 -4.333 -26.457 -9.818 -4.333 4.567 -4.333 15.889 electronvolt
mo.energy: -0.754 electronvolt
energy: -9.818 -4.333 -9.818 -9.818 -9.818 -9.818 -9.818 -4.333 -9.818 0.043 -4.333 4.567 electronvolt
mo.energy: -0.619 electronvolt
energy: -9.818 -9.818 -4.333 -9.818 -4.333 -4.333 -4.333 4.567 electronvolt
mo.energy: -0.535 electronvolt
energy: -9.818 -9.818 -9.818 -4.333 -9.818 -4.333 -9.818 -26.457 -9.818 4.567 electronvolt
mo.energy: -0.519 electronvolt
energy: -9.818 -9.818 -9.818 -9.818 -9.818 -4.333 -9.818 -9.818 -4.333 -4.333 -9.818 -9.818 electronvolt
mo.energy: -0.459 electronvolt
energy: -9.818 -9.818 -4.333 -9.818 electronvolt
mo.energy: -0.353 electronvolt
energy: -9.818 -4.333 0.043 4.567 electronvolt
mo.energy: -0.336 electronvolt
energy: -9.818 -4.333 0.043 electronvolt
mo.energy: -0.229 electronvolt
energy: -9.818 -9.818 -4.333 -4.333 -9.818 -9.818 -9.818 electronvolt
mo.energy: -0.061 electronvolt
energy: -9.818 -9.818 -9.818 -9.818 -9.818 -9.818 -9.818 4.567 -9.818 -26.457 4.567 electronvolt
mo.energy: 0.085 electronvolt
energy: -9.818 -9.818 0.043 10.337 -4.333 -45.645 electronvolt
mo.energy: 0.163 electronvolt
energy: -9.818 -9.818 -4.333 -4.333 electronvolt
mo.energy: 0.203 electronvolt
energy: -9.818 -9.818 -9.818 -9.818 -9.818 -4.333 -9.818 0.043 -4.333 -9.818 electronvolt
mo.energy: 0.206 electronvolt
energy: -9.818 -9.818 -9.818 4.567 -26.457 -4.333 electronvolt
mo.energy: 0.266 electronvolt
energy: -9.818 -9.818 -4.333 -9.818 0.043 -4.333 10.337 electronvolt
mo.energy: 0.411 electronvolt
energy: -9.818 -9.818 -9.818 -9.818 -9.818 -9.818 -9.818 -9.818 -9.818 0.043 -4.333 -26.457 -4.333 electronvolt
mo.energy: 0.417 electronvolt
energy: -9.818 -9.818 -9.818 -9.818 -9.818 -9.818 -9.818 0.043 -9.818 -9.818 -4.333 -9.818 0.043 -4.333 electronvolt
mo.energy: 0.569 electronvolt
energy: -9.818 -9.818 -9.818 -9.818 -9.818 -9.818 0.043 -9.818 -9.818 -4.333 -26.457 electronvolt
mo.energy: 0.710 electronvolt
energy: -9.818 -9.818 -9.818 -9.818 -9.818 -9.818 -9.818 -9.818 -9.818 -9.818 -4.333 electronvolt
mo.energy: 0.823 electronvolt
energy: -9.818 -9.818 -9.818 -9.818 -26.457 0.043 electronvolt
energy: -9.818 -9.818 -9.818 -9.818 -9.818 0.043 -9.818 -6.253 electronvolt
mo.energy: 1.186 electronvolt
energy: -9.818 -9.818 -9.818 -9.818 electronvolt
mo.energy: 1.237 electronvolt
energy: -9.818 -9.818 -9.818 -9.818 -9.818 -9.818 0.043 -9.818 -9.818 electronvolt
mo.energy: 1.271 electronvolt
energy: -9.818 -9.818 -9.818 -9.818 -9.818 -4.333 electronvolt
mo.energy: 1.307 electronvolt
energy: -9.818 -9.818 -9.818 -9.818 -9.818 -9.818 -9.818 -9.818 electronvolt
mo.energy: 1.309 electronvolt
energy: -9.818 -9.818 -9.818 -9.818 -9.818 -9.818 -9.818 electronvolt
mo.energy: 1.325 electronvolt
energy: -9.818 -9.818 electronvolt
mo.energy: 1.393 electronvolt
mo.energy: 1.406 electronvolt
energy: -9.818 -9.818 -9.818 -9.818 -9.818 0.043 -9.818 10.337 -6.253 electronvolt
mo.energy: 1.430 electronvolt
energy: -9.818 -4.333 -9.818 electronvolt
mo.energy: 1.667 electronvolt
energy: -9.818 -9.818 -9.818 electronvolt
mo.energy: 1.683 electronvolt
energy: -9.818 -9.818 -9.818 -9.818 -9.818 -9.818 electronvolt
mo.energy: 1.872 electronvolt
energy: -9.818 -9.818 -9.818 -9.818 -9.818 -9.818 -9.818 -9.818 -9.818 -9.818 10.337 electronvolt
mo.energy: 1.998 electronvolt
energy: -9.818 -9.818 -9.818 -9.818 -9.818 -9.818 -9.818 -9.818 -9.818 -9.818 10.337 -9.818 electronvolt
mo.energy: 2.054 electronvolt
energy: -9.818 -9.818 -9.818 -9.818 -9.818 -9.818 10.337 electronvolt
mo.energy: 2.067 electronvolt
energy: -9.818 -9.818 -9.818 -9.818 -9.818 -9.818 -9.818 -9.818 -9.818 -9.818 electronvolt
mo.energy: 2.107 electronvolt
energy: -9.818 -9.818 -9.818 -9.818 0.043 electronvolt
mo.energy: 2.150 electronvolt
mo.energy: 2.173 electronvolt
energy: -9.818 -9.818 -9.818 -4.333 -9.818 10.337 10.337 electronvolt
mo.energy: 2.177 electronvolt
energy: -9.818 -9.818 -9.818 10.337 0.043 10.337 electronvolt
mo.energy: 6.181 electronvolt
energy: -4.333 -9.818 4.567 10.337 30.399 30.399 electronvolt
mo.energy: 7.075 electronvolt
energy: -4.333 -9.818 -9.818 4.567 -4.333 10.337 0.043 electronvolt
mo.energy: 7.382 electronvolt
energy: -4.333 -4.333 -9.818 -9.818 10.337 electronvolt
mo.energy: 7.472 electronvolt
energy: -4.333 -9.818 -4.333 -9.818 4.567 -9.818 0.043 10.337 10.337 electronvolt
mo.energy: 7.724 electronvolt
energy: -4.333 -9.818 -4.333 -9.818 -9.818 -9.818 4.567 -9.818 10.337 -4.333 electronvolt
mo.energy: 7.770 electronvolt
energy: -4.333 -9.818 -4.333 -9.818 -9.818 10.337 10.337 electronvolt
mo.energy: 7.949 electronvolt
energy: -4.333 -9.818 4.567 -9.818 10.337 electronvolt
mo.energy: 7.957 electronvolt
energy: -4.333 -9.818 -4.333 4.567 -9.818 10.337 -9.818 -9.818 electronvolt
mo.energy: 7.992 electronvolt
energy: -4.333 -9.818 -9.818 -9.818 4.567 10.337 -9.818 -4.333 -9.818 -9.818 30.399 electronvolt
mo.energy: 8.013 electronvolt
energy: -4.333 -9.818 -9.818 4.567 -9.818 10.337 -9.818 -4.333 30.399 -4.333 electronvolt
mo.energy: 8.218 electronvolt
energy: -4.333 -9.818 -9.818 -9.818 -4.333 4.567 -4.333 electronvolt
mo.energy: 8.453 electronvolt
energy: -4.333 -4.333 -9.818 -9.818 -9.818 -4.333 4.567 4.567 -9.818 -9.818 -4.333 electronvolt
mo.energy: 8.606 electronvolt
energy: -4.333 -9.818 -4.333 4.567 -9.818 -4.333 -4.333 4.567 4.567 -26.457 0.043 -9.818 electronvolt
mo.energy: 8.713 electronvolt
energy: -4.333 -9.818 -4.333 -4.333 -9.818 4.567 1.543 -9.818 -9.818 -9.818 0.043 electronvolt
mo.energy: 8.735 electronvolt
energy: -4.333 -9.818 -9.818 4.567 -4.333 -4.333 1.543 -9.818 10.337 4.567 -9.818 -6.253 electronvolt
mo.energy: 8.766 electronvolt
energy: -4.333 -4.333 -9.818 -9.818 4.567 4.567 0.043 electronvolt
mo.energy: 8.771 electronvolt
energy: -4.333 -9.818 -9.818 4.567 -9.818 1.543 10.337 -4.333 electronvolt
mo.energy: 9.014 electronvolt
energy: -4.333 -9.818 -9.818 -4.333 4.567 -9.818 1.543 4.567 4.567 -9.818 -6.253 electronvolt
mo.energy: 9.235 electronvolt
energy: -4.333 -4.333 -9.818 -9.818 -9.818 -4.333 -9.818 4.567 -9.818 4.567 -9.818 4.567 -4.333 electronvolt
mo.energy: 9.404 electronvolt
energy: -4.333 -4.333 -9.818 -4.333 -9.818 -9.818 4.567 -9.818 -9.818 4.567 electronvolt
mo.energy: 9.595 electronvolt
energy: -4.333 -4.333 1.543 0.043 -26.457 -9.818 22.795 -6.253 -4.333 30.399 -9.818 -9.818 -9.818 1.543 electronvolt
mo.energy: 9.600 electronvolt
energy: -4.333 -9.818 -9.818 4.567 10.337 electronvolt
mo.energy: 9.614 electronvolt
energy: -4.333 -9.818 -4.333 -9.818 4.567 -9.818 -4.333 -9.818 4.567 -9.818 10.337 electronvolt
mo.energy: 9.620 electronvolt
energy: -4.333 -9.818 0.043 -26.457 -26.457 30.399 22.795 -4.333 22.795 -6.253 10.337 4.567 electronvolt
mo.energy: 9.788 electronvolt
energy: 1.543 1.543 -6.253 -6.253 15.889 10.337 4.567 0.043 22.795 -26.457 10.337 22.795 -4.333 electronvolt
mo.energy: 9.939 electronvolt
energy: 1.543 -6.253 1.543 -6.253 0.043 10.337 0.043 15.889 -4.333 10.337 4.567 22.795 15.889 4.567 electronvolt
mo.energy: 10.336 electronvolt
energy: 1.543 -6.253 0.043 0.043 10.337 -4.333 10.337 -9.818 22.795 10.337 -4.333 15.889 10.337 4.567 -9.818 electronvolt
mo.energy: 10.345 electronvolt
energy: 1.543 -4.333 -6.253 -4.333 -6.253 -9.818 -4.333 0.043 0.043 4.567 -9.818 22.795 -26.457 -9.818 22.795 -26.457 -4.333 0.043 10.337 electronvolt
mo.energy: 10.593 electronvolt
energy: -6.253 1.543 0.043 -4.333 -4.333 10.337 22.795 10.337 4.567 -26.457 4.567 electronvolt
mo.energy: 10.767 electronvolt
energy: 1.543 -6.253 0.043 0.043 10.337 -4.333 0.043 0.043 10.337 4.567 10.337 4.567 -9.818 10.337 4.567 -4.333 -9.818 15.889 electronvolt
mo.energy: 10.775 electronvolt
energy: -6.253 1.543 -6.253 4.567 0.043 1.543 -4.333 4.567 15.889 22.795 4.567 -9.818 -4.333 -9.818 -26.457 electronvolt
mo.energy: 10.907 electronvolt
energy: -4.333 1.543 1.543 -4.333 -4.333 -6.253 4.567 -9.818 0.043 -9.818 -9.818 -9.818 -26.457 -9.818 10.337 -9.818 0.043 22.795 electronvolt
mo.energy: 10.987 electronvolt
energy: -4.333 -4.333 -4.333 -9.818 1.543 -26.457 -9.818 -9.818 -4.333 4.567 0.043 22.795 -6.253 -9.818 -26.457 electronvolt
mo.energy: 11.106 electronvolt
energy: -6.253 1.543 0.043 0.043 -4.333 4.567 15.889 4.567 10.337 -4.333 10.337 4.567 electronvolt
mo.energy: 11.400 electronvolt
energy: -4.333 -4.333 1.543 0.043 -6.253 -9.818 1.543 -9.818 -9.818 -26.457 -9.818 0.043 22.795 10.337 30.399 10.337 4.567 -9.818 electronvolt
mo.energy: 11.439 electronvolt
energy: -4.333 -4.333 -4.333 0.043 -9.818 -9.818 -9.818 -26.457 4.567 22.795 1.543 0.043 15.889 -6.253 -4.333 electronvolt
