program: AMS
programVersion: 2021.106
runtype: GEOMETRY OPTIMIZATION
method: DFT
functional: Becke88 Perdew86
functional: VWN
spinMolecule: Restricted
formula: O32W10
InChI: InChI=1S/32O.10W
42 atoms
W  2.371627 -0.000000 1.940779
W  -2.371627 0.000000 1.940779
W  2.371627 -0.000000 -1.940779
W  -2.371627 0.000000 -1.940779
W  0.000000 2.371627 1.940779
W  -0.000000 -2.371627 1.940779
W  0.000000 2.371627 -1.940779
W  -0.000000 -2.371627 -1.940779
W  -0.000000 -0.000000 4.335492
W  -0.000000 -0.000000 -4.335492
O  -0.000000 -0.000000 1.993374
O  0.000000 0.000000 -1.993374
O  1.900677 1.900677 1.922876
O  -1.900677 1.900677 1.922876
O  1.900677 -1.900677 1.922876
O  -1.900677 -1.900677 1.922876
O  1.900677 1.900677 -1.922876
O  -1.900677 1.900677 -1.922876
O  1.900677 -1.900677 -1.922876
O  -1.900677 -1.900677 -1.922876
O  0.000000 1.900090 3.873862
O  -0.000000 -1.900090 3.873862
O  0.000000 1.900090 -3.873862
O  -0.000000 -1.900090 -3.873862
O  0.000000 2.337869 0.000000
O  -0.000000 -2.337869 0.000000
O  1.900090 -0.000000 3.873862
O  -1.900090 0.000000 3.873862
O  1.900090 -0.000000 -3.873862
O  -1.900090 0.000000 -3.873862
O  2.337869 -0.000000 0.000000
O  -2.337869 0.000000 0.000000
O  4.111450 -0.000000 2.201508
O  -4.111450 0.000000 2.201508
O  4.111450 -0.000000 -2.201508
O  -4.111450 0.000000 -2.201508
O  -0.000000 -0.000000 6.109352
O  -0.000000 -0.000000 -6.109352
O  0.000000 4.111450 2.201508
O  -0.000000 -4.111450 2.201508
O  0.000000 4.111450 -2.201508
O  -0.000000 -4.111450 -2.201508
elementType: W W W W W W W W W W O O O O O O O O O O O O O O O O O O O O O O O O O O O O O O O O
mdcq: 1.96918711 1.96918709 1.96918710 1.96918707 1.96918710 1.96918709 1.96918710 1.96918709 1.95592552 1.95592551 -0.61235568 -0.61235568 -0.79344537 -0.79344537 -0.79344537 -0.79344537 -0.79344538 -0.79344537 -0.79344537 -0.79344537 -0.80665530 -0.80665530 -0.80665530 -0.80665529 -0.76290333 -0.76290333 -0.80665530 -0.80665529 -0.80665530 -0.80665530 -0.76290333 -0.76290333 -0.64685036 -0.64685037 -0.64685036 -0.64685037 -0.70670741 -0.70670741 -0.64685036 -0.64685037 -0.64685036 -0.64685037
eener: -310.708656 electronvolt
kinener: 255.439032 electronvolt
coulombener: 9.945157 electronvolt
xcener: -303.344827 electronvolt
dispener: 0.000000 electronvolt
total: -348.669294 electronvolt
charge: 2.47793495 2.47793495 2.47793495 2.47793495 2.47793495 2.47793495 2.47793495 2.47793495 2.39221595 2.39221595 -1.18415129 -1.18415129 -0.93037034 -0.93037034 -0.93037034 -0.93037034 -0.93037034 -0.93037034 -0.93037034 -0.93037034 -0.91484158 -0.91484158 -0.91484158 -0.91484158 -0.93476691 -0.93476691 -0.91484158 -0.91484158 -0.91484158 -0.91484158 -0.93476691 -0.93476691 -0.76580102 -0.76580102 -0.76580102 -0.76580102 -0.80621890 -0.80621890 -0.76580102 -0.76580102 -0.76580102 -0.76580102
dipole: -0.00000000 0.00000000 -0.00000000
dipole: 0.000000
quadrupole: 49.68697032 -0.00000000 -0.00000000 49.68697032 0.00000000 -99.37394063
charge: -4
converged: GEOMETRY CONVERGED
charge: 2.4779 2.4779 2.4779 2.4779 2.4779 2.4779 2.4779 2.4779 2.3922 2.3922 -1.1842 -1.1842 -0.9304 -0.9304 -0.9304 -0.9304 -0.9304 -0.9304 -0.9304 -0.9304 -0.9148 -0.9148 -0.9148 -0.9148 -0.9348 -0.9348 -0.9148 -0.9148 -0.9148 -0.9148 -0.9348 -0.9348 -0.7658 -0.7658 -0.7658 -0.7658 -0.8062 -0.8062 -0.7658 -0.7658 -0.7658 -0.7658
mo.energy: -14.510 electronvolt
energy: -24.141 -24.141 -24.141 -24.141 -5.836 -24.141 1.301 -9.204 electronvolt
mo.energy: -14.351 electronvolt
energy: -24.141 -24.141 -24.141 -24.141 -5.836 -9.204 -4.627 -5.836 electronvolt
mo.energy: -13.907 electronvolt
energy: -24.141 -24.141 -24.141 -24.141 -5.836 -4.627 electronvolt
mo.energy: -13.853 electronvolt
energy: -24.141 -24.141 -4.627 -24.141 -4.627 3.974 -24.141 electronvolt
mo.energy: -13.823 electronvolt
energy: -24.141 -24.141 -4.627 -4.627 -24.141 3.974 electronvolt
mo.energy: -13.798 electronvolt
energy: -24.141 -24.141 -4.627 -4.627 -24.141 -9.204 electronvolt
mo.energy: -13.671 electronvolt
energy: -24.141 -24.141 -24.141 -5.836 -4.627 -9.204 electronvolt
mo.energy: -13.469 electronvolt
energy: -24.141 -4.627 -4.627 -0.653 -24.141 electronvolt
mo.energy: -13.459 electronvolt
energy: -24.141 -24.141 -24.141 -4.627 -4.627 3.974 -0.653 electronvolt
mo.energy: -13.282 electronvolt
energy: -24.141 -24.141 -24.141 -24.141 -24.141 -4.627 -5.836 electronvolt
mo.energy: -13.175 electronvolt
energy: -24.141 -24.141 -4.627 -24.141 -24.141 -24.141 -4.627 3.974 -4.627 electronvolt
mo.energy: -13.171 electronvolt
energy: -24.141 -24.141 -24.141 -4.627 -24.141 -24.141 3.974 -4.627 electronvolt
mo.energy: -13.103 electronvolt
energy: -24.141 -24.141 -24.141 -4.627 -4.627 electronvolt
mo.energy: -13.058 electronvolt
energy: -24.141 -4.627 -43.279 electronvolt
mo.energy: -13.043 electronvolt
mo.energy: -13.020 electronvolt
mo.energy: -12.993 electronvolt
energy: -24.141 -4.627 -4.627 -43.279 -24.141 -9.204 -0.653 electronvolt
mo.energy: -12.986 electronvolt
energy: -24.141 -4.627 -24.141 -4.627 -43.279 -0.653 electronvolt
mo.energy: -12.977 electronvolt
energy: -24.141 -24.141 -4.627 -4.627 -43.279 -24.141 electronvolt
mo.energy: -12.973 electronvolt
energy: -24.141 -24.141 -24.141 -4.627 -4.627 -4.627 electronvolt
mo.energy: -12.858 electronvolt
energy: -24.141 -24.141 -4.627 -24.141 -24.141 -0.653 -43.279 electronvolt
mo.energy: -12.844 electronvolt
energy: -24.141 -24.141 -4.627 -24.141 -24.141 -24.141 -43.279 electronvolt
mo.energy: -12.812 electronvolt
energy: -24.141 -24.141 electronvolt
mo.energy: -12.269 electronvolt
energy: -24.141 -24.141 -24.141 -0.653 -24.141 electronvolt
mo.energy: -12.262 electronvolt
mo.energy: -2.503 electronvolt
energy: -9.204 -4.627 -9.204 -9.204 3.974 -4.627 1.301 1.301 electronvolt
mo.energy: -2.476 electronvolt
energy: -9.204 -4.627 -9.204 -9.204 -4.627 -9.204 3.974 -4.627 3.974 electronvolt
mo.energy: -2.327 electronvolt
energy: -9.204 -4.627 -4.627 3.974 1.301 -5.836 electronvolt
mo.energy: -2.297 electronvolt
energy: -9.204 -4.627 3.974 -9.204 1.301 -9.204 -9.204 -5.836 electronvolt
mo.energy: -1.996 electronvolt
energy: -9.204 -4.627 -9.204 -9.204 3.974 -24.141 electronvolt
mo.energy: -1.502 electronvolt
energy: -9.204 -4.627 -4.627 -9.204 -9.204 -9.204 -4.627 -9.204 -9.204 -0.653 3.974 3.974 -9.204 3.974 electronvolt
mo.energy: -1.498 electronvolt
energy: -4.627 -9.204 -9.204 -9.204 -4.627 3.974 -4.627 -9.204 3.974 electronvolt
mo.energy: -1.490 electronvolt
energy: -9.204 -9.204 -4.627 -4.627 -4.627 -9.204 -9.204 -9.204 -9.204 -0.653 -9.204 -4.627 -4.627 -9.204 -9.204 -9.204 -24.141 electronvolt
mo.energy: -1.464 electronvolt
energy: -9.204 -9.204 -4.627 -4.627 -4.627 -9.204 -9.204 -9.204 -9.204 -4.627 -0.653 -9.204 -9.204 -9.204 -9.204 -9.204 -24.141 -24.141 electronvolt
mo.energy: -1.395 electronvolt
energy: -9.204 -9.204 -4.627 -4.627 3.974 -9.204 electronvolt
mo.energy: -1.107 electronvolt
energy: -9.204 -9.204 -4.627 -4.627 -9.204 -4.627 3.974 -9.204 3.974 -24.141 electronvolt
mo.energy: -1.081 electronvolt
energy: -9.204 -4.627 -9.204 -9.204 -9.204 3.974 -4.627 -24.141 1.301 -9.204 9.644 electronvolt
mo.energy: -0.963 electronvolt
energy: -9.204 -9.204 -9.204 -9.204 -4.627 -4.627 -4.627 -9.204 -9.204 -9.204 3.974 -4.627 -9.204 -9.204 3.974 -9.204 electronvolt
mo.energy: -0.857 electronvolt
energy: -9.204 -4.627 -9.204 -24.141 -4.627 -9.204 -9.204 3.974 electronvolt
mo.energy: -0.820 electronvolt
energy: -9.204 -4.627 -9.204 -9.204 -4.627 -9.204 -9.204 -9.204 -9.204 -0.653 3.974 -9.204 -24.141 -0.653 electronvolt
mo.energy: -0.804 electronvolt
energy: -9.204 -9.204 -4.627 3.974 -24.141 -4.627 -9.204 -4.627 electronvolt
mo.energy: -0.779 electronvolt
energy: -9.204 -4.627 -9.204 -9.204 -9.204 -4.627 -4.627 -9.204 -4.627 -4.627 -24.141 -9.204 -9.204 -9.204 -9.204 3.974 -9.204 -4.627 -9.204 electronvolt
mo.energy: -0.739 electronvolt
energy: -9.204 -4.627 -9.204 -9.204 -4.627 -9.204 -4.627 -24.141 electronvolt
mo.energy: -0.334 electronvolt
energy: -4.627 -4.627 -9.204 -9.204 -9.204 -9.204 -4.627 -9.204 -4.627 -9.204 -9.204 -9.204 -9.204 -9.204 -9.204 -4.627 electronvolt
mo.energy: -0.175 electronvolt
energy: -4.627 -9.204 -9.204 -4.627 -9.204 -9.204 -9.204 -9.204 -9.204 -9.204 -4.627 -9.204 3.974 -9.204 electronvolt
mo.energy: -0.174 electronvolt
energy: -9.204 -9.204 -4.627 -9.204 -24.141 3.974 -4.627 -4.627 -0.653 -9.204 3.974 -9.204 20.489 electronvolt
mo.energy: -0.135 electronvolt
energy: -9.204 -9.204 -9.204 -4.627 -4.627 -24.141 -9.204 -0.653 3.974 20.489 -9.204 electronvolt
mo.energy: -0.110 electronvolt
energy: -4.627 -9.204 -9.204 -9.204 -9.204 -9.204 3.974 electronvolt
mo.energy: 0.192 electronvolt
energy: -9.204 -9.204 -9.204 -4.627 -9.204 -9.204 -9.204 -4.627 -9.204 -9.204 3.974 -4.627 -4.627 electronvolt
mo.energy: 0.305 electronvolt
energy: -9.204 -9.204 -9.204 -4.627 -9.204 -4.627 -4.627 -24.141 -24.141 -9.204 -4.627 -9.204 -0.653 -9.204 -24.141 electronvolt
mo.energy: 0.385 electronvolt
energy: -9.204 -9.204 -9.204 -4.627 -9.204 -4.627 -9.204 -9.204 -4.627 -9.204 -9.204 electronvolt
mo.energy: 0.388 electronvolt
energy: -9.204 -4.627 -9.204 -24.141 -4.627 -9.204 3.974 -24.141 -9.204 electronvolt
mo.energy: 0.408 electronvolt
energy: -9.204 -9.204 -4.627 -9.204 -4.627 -9.204 -0.653 3.974 -4.627 electronvolt
mo.energy: 0.409 electronvolt
energy: -9.204 -9.204 -4.627 -9.204 -9.204 -9.204 -4.627 -9.204 -4.627 -9.204 -9.204 -4.627 -24.141 -4.627 -9.204 electronvolt
mo.energy: 0.488 electronvolt
energy: -9.204 -4.627 -9.204 -9.204 -9.204 -9.204 -9.204 -9.204 -4.627 -4.627 -9.204 -0.653 -4.627 electronvolt
mo.energy: 0.505 electronvolt
energy: -9.204 -9.204 -9.204 -9.204 -4.627 -4.627 -9.204 -4.627 -9.204 -9.204 -24.141 -24.141 3.974 3.974 electronvolt
mo.energy: 0.517 electronvolt
energy: -9.204 -9.204 -4.627 -24.141 -4.627 -9.204 3.974 -9.204 3.974 electronvolt
energy: -9.204 -4.627 -9.204 -24.141 -4.627 -9.204 3.974 -4.627 3.974 15.125 electronvolt
mo.energy: 0.694 electronvolt
energy: -9.204 -9.204 -4.627 -9.204 -4.627 -4.627 -4.627 electronvolt
mo.energy: 0.715 electronvolt
energy: -9.204 -9.204 -4.627 -9.204 -9.204 20.489 -4.627 electronvolt
mo.energy: 0.728 electronvolt
energy: -9.204 -9.204 -9.204 -4.627 -9.204 -9.204 -9.204 -9.204 -4.627 -4.627 -24.141 electronvolt
mo.energy: 0.731 electronvolt
energy: -9.204 -9.204 -9.204 -4.627 -9.204 -4.627 -24.141 -9.204 3.974 electronvolt
mo.energy: 0.920 electronvolt
energy: -9.204 -4.627 -9.204 -4.627 -9.204 electronvolt
mo.energy: 0.927 electronvolt
energy: -9.204 -4.627 -4.627 -9.204 -9.204 electronvolt
mo.energy: 0.982 electronvolt
energy: -9.204 -9.204 -4.627 -9.204 -9.204 -4.627 -9.204 -9.204 electronvolt
mo.energy: 1.096 electronvolt
energy: -9.204 -9.204 -9.204 -9.204 -9.204 -9.204 -9.204 3.974 -24.141 -9.204 -0.653 -4.627 electronvolt
mo.energy: 1.239 electronvolt
energy: -9.204 -9.204 -4.627 -4.627 electronvolt
mo.energy: 1.277 electronvolt
energy: -9.204 -4.627 -9.204 -9.204 -0.653 9.644 3.974 20.489 electronvolt
mo.energy: 1.332 electronvolt
energy: -9.204 -9.204 -9.204 -24.141 3.974 -4.627 electronvolt
mo.energy: 1.375 electronvolt
energy: -9.204 -9.204 -9.204 -9.204 -9.204 -4.627 -4.627 -9.204 -9.204 -9.204 -0.653 electronvolt
mo.energy: 1.397 electronvolt
energy: -9.204 -9.204 -4.627 -9.204 -4.627 -9.204 -0.653 9.644 3.974 electronvolt
mo.energy: 1.565 electronvolt
energy: -9.204 -9.204 -9.204 -9.204 -9.204 -9.204 -9.204 -9.204 -9.204 -4.627 -0.653 -24.141 -4.627 -24.141 electronvolt
mo.energy: 1.613 electronvolt
energy: -9.204 -9.204 -9.204 -9.204 -9.204 -9.204 -9.204 -4.627 -0.653 -9.204 -9.204 -9.204 -4.627 -0.653 electronvolt
mo.energy: 1.733 electronvolt
energy: -9.204 -9.204 -9.204 -9.204 -9.204 -9.204 -0.653 -4.627 -9.204 -9.204 -24.141 electronvolt
mo.energy: 1.882 electronvolt
energy: -9.204 -9.204 -9.204 -9.204 -9.204 -9.204 -9.204 -9.204 -9.204 -9.204 -4.627 electronvolt
mo.energy: 1.943 electronvolt
energy: -9.204 -9.204 -9.204 -9.204 -24.141 -4.627 -4.627 electronvolt
mo.energy: 1.959 electronvolt
energy: -9.204 -9.204 -9.204 -9.204 -0.653 -9.204 -9.204 electronvolt
mo.energy: 2.261 electronvolt
energy: -9.204 -9.204 -9.204 -9.204 -24.141 electronvolt
mo.energy: 2.307 electronvolt
energy: -9.204 -9.204 -9.204 -9.204 -9.204 -9.204 -9.204 -0.653 -9.204 -9.204 electronvolt
mo.energy: 2.339 electronvolt
energy: -9.204 -9.204 -9.204 -9.204 -4.627 -9.204 -0.653 electronvolt
mo.energy: 2.360 electronvolt
energy: -9.204 -4.627 -9.204 3.974 electronvolt
mo.energy: 2.376 electronvolt
energy: -9.204 -9.204 -9.204 -9.204 -9.204 -9.204 -9.204 -9.204 -9.204 electronvolt
mo.energy: 2.404 electronvolt
energy: -9.204 -9.204 electronvolt
mo.energy: 2.433 electronvolt
energy: -9.204 -9.204 -9.204 -9.204 -9.204 -9.204 -9.204 electronvolt
mo.energy: 2.452 electronvolt
energy: -9.204 -9.204 -9.204 -9.204 -9.204 -9.204 -9.204 -9.204 electronvolt
mo.energy: 2.468 electronvolt
energy: -9.204 -9.204 -9.204 -9.204 -9.204 -0.653 -9.204 9.644 electronvolt
mo.energy: 2.728 electronvolt
energy: -9.204 -9.204 -9.204 electronvolt
mo.energy: 2.752 electronvolt
mo.energy: 2.889 electronvolt
energy: -9.204 -9.204 -9.204 -9.204 -9.204 -9.204 -9.204 -9.204 -9.204 -9.204 electronvolt
mo.energy: 3.046 electronvolt
energy: -9.204 -9.204 -9.204 -9.204 -9.204 -9.204 -9.204 -9.204 -9.204 -9.204 -9.204 9.644 electronvolt
mo.energy: 3.068 electronvolt
energy: -9.204 -9.204 -9.204 -9.204 -9.204 -9.204 -0.653 electronvolt
mo.energy: 3.071 electronvolt
mo.energy: 3.110 electronvolt
energy: -9.204 -9.204 -9.204 9.644 9.644 -0.653 electronvolt
mo.energy: 3.124 electronvolt
energy: -9.204 -9.204 -9.204 -4.627 -9.204 electronvolt
mo.energy: 3.152 electronvolt
energy: -9.204 -9.204 -9.204 -9.204 -9.204 -9.204 electronvolt
mo.energy: 3.206 electronvolt
mo.energy: 5.497 electronvolt
energy: -4.627 -9.204 3.974 9.644 electronvolt
mo.energy: 6.265 electronvolt
energy: -4.627 -9.204 -9.204 3.974 -4.627 9.644 electronvolt
mo.energy: 6.531 electronvolt
energy: -4.627 -9.204 -4.627 -9.204 9.644 3.974 electronvolt
mo.energy: 6.605 electronvolt
energy: -4.627 -9.204 -4.627 -9.204 3.974 -9.204 9.644 electronvolt
mo.energy: 6.790 electronvolt
energy: -4.627 -9.204 -4.627 -9.204 -9.204 3.974 -9.204 -9.204 9.644 -4.627 electronvolt
mo.energy: 6.847 electronvolt
energy: -4.627 -9.204 -4.627 -9.204 -9.204 9.644 9.644 3.974 electronvolt
mo.energy: 6.992 electronvolt
energy: -4.627 -9.204 3.974 -9.204 9.644 electronvolt
mo.energy: 7.007 electronvolt
mo.energy: 7.033 electronvolt
energy: -4.627 -9.204 -9.204 -9.204 3.974 -9.204 -9.204 9.644 -4.627 -9.204 electronvolt
mo.energy: 7.050 electronvolt
energy: -4.627 -9.204 -9.204 3.974 -9.204 9.644 -9.204 -4.627 -4.627 electronvolt
mo.energy: 7.247 electronvolt
energy: -4.627 -9.204 -9.204 -9.204 -4.627 3.974 -4.627 electronvolt
mo.energy: 7.451 electronvolt
energy: -4.627 -4.627 -9.204 -9.204 -9.204 -4.627 3.974 3.974 -9.204 -9.204 -4.627 electronvolt
mo.energy: 7.566 electronvolt
energy: -4.627 -9.204 -4.627 -9.204 3.974 -4.627 -4.627 3.974 -9.204 -24.141 electronvolt
mo.energy: 7.648 electronvolt
energy: -4.627 -9.204 -4.627 -9.204 -4.627 3.974 -9.204 -9.204 -9.204 -0.653 electronvolt
mo.energy: 7.681 electronvolt
energy: -4.627 -9.204 -9.204 3.974 -4.627 -4.627 -9.204 -9.204 9.644 -9.204 electronvolt
mo.energy: 7.683 electronvolt
energy: -4.627 -4.627 -9.204 -9.204 3.974 3.974 electronvolt
mo.energy: 7.708 electronvolt
energy: -4.627 -9.204 -9.204 3.974 -9.204 9.644 electronvolt
mo.energy: 7.949 electronvolt
energy: -4.627 -9.204 -9.204 -4.627 -9.204 3.974 -9.204 electronvolt
mo.energy: 8.119 electronvolt
energy: -4.627 -4.627 -9.204 -9.204 -9.204 -9.204 -4.627 -9.204 3.974 -4.627 -9.204 3.974 electronvolt
mo.energy: 8.227 electronvolt
energy: -4.627 -4.627 -9.204 -4.627 -9.204 -9.204 -9.204 3.974 -9.204 3.974 electronvolt
mo.energy: 8.398 electronvolt
energy: -4.627 -9.204 -9.204 3.974 9.644 electronvolt
mo.energy: 8.413 electronvolt
energy: -4.627 -9.204 -4.627 -9.204 -9.204 3.974 -4.627 -9.204 -9.204 3.974 9.644 electronvolt
mo.energy: 8.557 electronvolt
energy: -4.627 -9.204 -0.653 -24.141 -24.141 28.861 24.443 24.443 -5.836 -4.627 3.974 20.489 -9.204 electronvolt
mo.energy: 8.624 electronvolt
energy: -4.627 -4.627 -0.653 -24.141 -9.204 24.443 -9.204 -4.627 -5.836 -9.204 28.861 -9.204 electronvolt
mo.energy: 9.294 electronvolt
energy: 1.301 -5.836 -4.627 -4.627 -4.627 -5.836 -9.204 -0.653 -0.653 -9.204 -24.141 -9.204 -4.627 24.443 1.301 15.125 -24.141 -9.204 electronvolt
mo.energy: 9.586 electronvolt
energy: 1.301 1.301 -4.627 -5.836 -4.627 -4.627 -9.204 -4.627 24.443 24.443 -24.141 -9.204 -24.141 -9.204 -0.653 15.125 electronvolt
mo.energy: 9.681 electronvolt
energy: 1.301 -5.836 1.301 -5.836 -0.653 9.644 24.443 15.125 -0.653 electronvolt
mo.energy: 9.773 electronvolt
energy: -4.627 -4.627 -4.627 -9.204 -24.141 -9.204 -9.204 -5.836 3.974 -0.653 -9.204 24.443 -24.141 3.974 electronvolt
mo.energy: 10.040 electronvolt
energy: -4.627 -4.627 -5.836 1.301 -9.204 -9.204 -0.653 1.301 -5.836 -9.204 -9.204 -24.141 -24.141 -24.141 24.443 3.974 24.443 -9.204 28.861 -9.204 electronvolt
mo.energy: 10.076 electronvolt
energy: 1.301 -5.836 -0.653 -0.653 9.644 24.443 -9.204 -4.627 9.644 15.125 9.644 electronvolt
mo.energy: 10.261 electronvolt
energy: -4.627 -4.627 -4.627 -9.204 -0.653 -9.204 -9.204 -24.141 3.974 24.443 -0.653 -4.627 20.489 electronvolt
mo.energy: 10.345 electronvolt
energy: 1.301 1.301 -5.836 -4.627 -5.836 -0.653 3.974 -0.653 -9.204 24.443 9.644 -0.653 -4.627 -24.141 -9.204 -4.627 electronvolt
mo.energy: 10.365 electronvolt
energy: -5.836 1.301 -4.627 -0.653 -4.627 24.443 3.974 3.974 -24.141 -9.204 -4.627 9.644 electronvolt
mo.energy: 10.524 electronvolt
energy: 1.301 -5.836 -0.653 -0.653 9.644 -0.653 3.974 -0.653 9.644 3.974 -4.627 9.644 9.644 24.443 -9.204 electronvolt
mo.energy: 10.643 electronvolt
energy: -4.627 -9.204 -9.204 -4.627 -4.627 3.974 -24.141 3.974 -24.141 -0.653 -5.836 24.443 -24.141 24.443 electronvolt
mo.energy: 10.653 electronvolt
energy: -5.836 1.301 -4.627 3.974 1.301 -5.836 -0.653 -9.204 -9.204 -4.627 3.974 3.974 24.443 -0.653 9.644 -24.141 9.644 electronvolt
mo.energy: 10.762 electronvolt
energy: -5.836 1.301 -4.627 -0.653 -4.627 -0.653 -9.204 24.443 -9.204 -24.141 9.644 3.974 -9.204 electronvolt
