program: AMS
programVersion: 2021.106
runtype: GEOMETRY OPTIMIZATION
method: DFT
functional: PBE0 == Not Default ==
spinMolecule: Restricted
formula: O40SiW12
InChI: InChI=1S/O4Si.36O.12W/c1-5(2,3)4;;;;;;;;;;;;;;;;;;;;;;;;;;;;;;;;;;;;;;;;;;;;;;;;
53 atoms
W  1.506887 0.000000 3.492938
W  2.955739 1.670862 0.887609
W  -0.000000 3.531139 -0.175839
W  1.677678 1.880708 -2.526805
W  -1.506887 -0.000000 3.492938
W  -2.955739 1.670862 0.887609
W  -2.955739 -1.670862 0.887609
W  2.955739 -1.670862 0.887609
W  0.000000 -3.531139 -0.175839
W  1.677678 -1.880708 -2.526805
W  -1.677678 -1.880708 -2.526805
W  -1.677678 1.880708 -2.526805
O  -0.000000 1.204756 3.423190
O  0.000000 -1.204756 3.423190
O  1.741716 0.000000 -2.837844
O  -1.741716 -0.000000 -2.837844
O  1.423798 -2.860603 0.875554
O  -1.423798 -2.860603 0.875554
O  -1.423798 2.860603 0.875554
O  1.423798 2.860603 0.875554
O  2.822549 -1.583240 -0.993845
O  2.822549 1.583240 -0.993845
O  -2.822549 -1.583240 -0.993845
O  -2.822549 1.583240 -0.993845
O  0.000000 -2.001485 -3.452754
O  -0.000000 2.001485 -3.452754
O  2.607184 -1.358561 2.774529
O  -2.607184 -1.358561 2.774529
O  -2.607184 1.358561 2.774529
O  2.607184 1.358561 2.774529
O  3.899048 0.000000 0.898241
O  -3.899048 -0.000000 0.898241
O  -1.259725 -3.513482 -1.654397
O  1.259725 -3.513482 -1.654397
O  -1.259725 3.513482 -1.654397
O  1.259725 3.513482 -1.654397
O  -1.957945 0.000000 5.139874
O  1.957945 -0.000000 5.139874
O  2.764683 2.443404 -3.716405
O  -2.764683 -2.443404 -3.716405
O  -2.764683 2.443404 -3.716405
O  2.764683 -2.443404 -3.716405
O  4.256316 -2.760666 1.066892
O  -4.256316 -2.760666 1.066892
O  -4.256316 2.760666 1.066892
O  4.256316 2.760666 1.066892
O  0.000000 -5.189548 0.230969
O  -0.000000 5.189548 0.230969
O  0.000000 -1.333695 -0.966511
O  -0.000000 1.333695 -0.966511
O  -1.346040 -0.000000 0.925591
O  1.346040 0.000000 0.925591
Si 0.000000 0.000000 0.000246
elementType: W W W W W W W W W W W W O O O O O O O O O O O O O O O O O O O O O O O O O O O O O O O O O O O O O O O O Si
mdcq: 2.10437312 2.15524009 2.12583483 2.14157106 2.10437310 2.15524006 2.15524007 2.15524010 2.12583484 2.14157111 2.14157109 2.14157113 -0.81671331 -0.81671331 -0.81501227 -0.81501227 -0.79621294 -0.79621294 -0.79621294 -0.79621294 -0.81955649 -0.81955650 -0.81955650 -0.81955649 -0.82079937 -0.82079937 -0.81164662 -0.81164662 -0.81164662 -0.81164662 -0.81696442 -0.81696442 -0.82466272 -0.82466272 -0.82466271 -0.82466272 -0.69617326 -0.69617326 -0.66599053 -0.66599053 -0.66599052 -0.66599052 -0.66525123 -0.66525124 -0.66525124 -0.66525124 -0.66881288 -0.66881288 -0.84508869 -0.84508869 -0.84675752 -0.84675752 1.33826499
eener: -450.407338 electronvolt
kinener: 619.464839 electronvolt
coulombener: -183.374019 electronvolt
xcener: -573.227732 electronvolt
dispener: 0.000000 electronvolt
total: -587.544249 electronvolt
charge: 2.68660833 2.76567853 2.71425718 2.73293363 2.68660833 2.76567853 2.76567853 2.76567853 2.71425718 2.73293363 2.73293363 2.73293363 -1.01344494 -1.01344494 -1.07054916 -1.07054916 -1.05261750 -1.05261750 -1.05261750 -1.05261750 -1.04381812 -1.04381812 -1.04381812 -1.04381812 -1.03958123 -1.03958123 -1.04407237 -1.04407237 -1.04407237 -1.04407237 -1.03315630 -1.03315630 -1.01021236 -1.01021236 -1.01021236 -1.01021236 -0.81556738 -0.81556738 -0.80889239 -0.80889239 -0.80889239 -0.80889239 -0.80329237 -0.80329237 -0.80329237 -0.80329237 -0.80958371 -0.80958371 -1.22432663 -1.22432663 -1.22207053 -1.22207053 2.71200047
dipole: 0.00000000 -0.00000000 -0.43209522
dipole: 0.432095
quadrupole: 3.81843096 -0.00000000 -0.00000000 2.95500961 -0.00000000 -6.77344056
charge: -4
converged: GEOMETRY CONVERGED
charge: 2.6866 2.7657 2.7143 2.7329 2.6866 2.7657 2.7657 2.7657 2.7143 2.7329 2.7329 2.7329 -1.0134 -1.0134 -1.0705 -1.0705 -1.0526 -1.0526 -1.0526 -1.0526 -1.0438 -1.0438 -1.0438 -1.0438 -1.0396 -1.0396 -1.0441 -1.0441 -1.0441 -1.0441 -1.0332 -1.0332 -1.0102 -1.0102 -1.0102 -1.0102 -0.8156 -0.8156 -0.8089 -0.8089 -0.8089 -0.8089 -0.8033 -0.8033 -0.8033 -0.8033 -0.8096 -0.8096 -1.2243 -1.2243 -1.2221 -1.2221 2.7120
mo.energy: -17.997 electronvolt
energy: -27.198 -27.198 -27.198 -27.198 -27.198 -4.382 -4.382 -27.198 -4.382 -6.463 electronvolt
mo.energy: -17.971 electronvolt
energy: -27.198 -27.198 -27.198 -27.198 -27.198 -27.198 -4.382 -27.198 -27.198 -27.198 -4.382 -27.198 electronvolt
mo.energy: -17.877 electronvolt
energy: -27.198 -27.198 -27.198 -27.198 -27.198 -27.198 -27.198 -4.382 -4.382 -4.382 -27.198 -4.382 electronvolt
mo.energy: -17.830 electronvolt
energy: -27.198 -27.198 -27.198 -4.382 -27.198 -6.463 -4.382 electronvolt
mo.energy: -17.747 electronvolt
energy: -27.198 -27.198 -27.198 -27.198 -27.198 -27.198 -27.198 -4.382 -4.382 -3.913 electronvolt
mo.energy: -17.730 electronvolt
energy: -27.198 -27.198 -27.198 -27.198 -27.198 -27.198 -4.382 -27.198 -27.198 -4.382 -27.198 -27.198 -27.198 electronvolt
mo.energy: -17.638 electronvolt
energy: -27.198 -27.198 -27.198 -27.198 -27.198 -4.382 -4.382 -27.198 -27.198 -27.198 electronvolt
mo.energy: -17.607 electronvolt
energy: -27.198 -27.198 -27.198 -27.198 -27.198 -27.198 -4.382 -3.913 -4.382 -27.198 -27.198 -27.198 -27.198 11.469 electronvolt
mo.energy: -17.584 electronvolt
energy: -27.198 -27.198 -4.382 -27.198 -4.382 -27.198 electronvolt
mo.energy: -17.553 electronvolt
energy: -27.198 -27.198 -27.198 -27.198 -27.198 -4.382 -4.382 -27.198 -27.198 electronvolt
mo.energy: -17.544 electronvolt
energy: -27.198 -27.198 -27.198 -27.198 -4.382 -3.913 -4.382 -27.198 -27.198 -27.198 11.469 2.299 electronvolt
mo.energy: -17.196 electronvolt
energy: -27.198 -27.198 -27.198 -27.198 -27.198 -27.198 -27.198 -27.198 -27.198 -6.463 -4.382 electronvolt
mo.energy: -17.161 electronvolt
energy: -27.198 -27.198 -27.198 -27.198 -27.198 -6.463 -4.382 -4.382 electronvolt
mo.energy: -17.158 electronvolt
energy: -27.198 -27.198 -27.198 -27.198 -27.198 -27.198 -27.198 -27.198 -27.198 electronvolt
mo.energy: -17.151 electronvolt
energy: -27.198 -27.198 -27.198 -27.198 -27.198 -4.382 -6.463 electronvolt
mo.energy: -17.116 electronvolt
energy: -27.198 -27.198 -27.198 -27.198 -27.198 -4.382 -27.198 electronvolt
mo.energy: -17.021 electronvolt
energy: -27.198 -27.198 -27.198 -27.198 -27.198 -4.382 -27.198 -27.198 electronvolt
mo.energy: -16.956 electronvolt
energy: -27.198 -27.198 -27.198 -27.198 -27.198 -27.198 -4.382 -4.382 electronvolt
mo.energy: -16.954 electronvolt
mo.energy: -16.865 electronvolt
energy: -27.198 -27.198 -27.198 -27.198 -4.382 -4.382 electronvolt
mo.energy: -16.863 electronvolt
energy: -27.198 -4.382 -27.198 -27.198 -4.382 -27.198 -46.382 electronvolt
mo.energy: -16.855 electronvolt
energy: -27.198 -27.198 -27.198 -27.198 -4.382 -4.382 -4.382 -4.382 electronvolt
mo.energy: -16.847 electronvolt
energy: -27.198 -27.198 -4.382 -27.198 -4.382 -27.198 -27.198 electronvolt
mo.energy: -16.838 electronvolt
energy: -27.198 -27.198 -27.198 -27.198 -4.382 -27.198 -27.198 -4.382 electronvolt
mo.energy: -16.835 electronvolt
energy: -27.198 -27.198 -27.198 -4.382 -27.198 -4.382 -27.198 -27.198 electronvolt
mo.energy: -16.808 electronvolt
mo.energy: -16.786 electronvolt
energy: -27.198 -27.198 -4.382 -27.198 -27.198 -27.198 -46.382 -4.382 electronvolt
mo.energy: -16.779 electronvolt
energy: -27.198 -27.198 -27.198 -4.382 -27.198 -27.198 -46.382 -27.198 -4.382 electronvolt
mo.energy: -16.734 electronvolt
energy: -27.198 -27.198 -27.198 -27.198 -27.198 -27.198 -27.198 -27.198 -27.198 -27.198 -27.198 -27.198 -27.198 electronvolt
mo.energy: -16.715 electronvolt
energy: -27.198 -27.198 -27.198 -4.382 -4.382 electronvolt
mo.energy: -16.707 electronvolt
energy: -27.198 -27.198 -27.198 -27.198 -27.198 -27.198 -27.198 -27.198 -27.198 -27.198 electronvolt
mo.energy: -16.702 electronvolt
energy: -27.198 -27.198 -27.198 -27.198 -4.382 -27.198 -3.913 electronvolt
mo.energy: -16.679 electronvolt
energy: -27.198 -27.198 -27.198 -27.198 -27.198 -27.198 electronvolt
mo.energy: -16.664 electronvolt
energy: -27.198 -27.198 -27.198 -27.198 -27.198 -27.198 -27.198 -27.198 -27.198 -27.198 -46.382 electronvolt
mo.energy: -16.587 electronvolt
energy: -27.198 -27.198 -27.198 -27.198 -46.382 electronvolt
mo.energy: -6.389 electronvolt
energy: -9.955 -9.955 -9.955 -9.955 4.178 -12.276 -27.198 -27.198 -4.382 -9.955 -4.382 -4.382 10.811 10.811 -9.955 -9.955 -4.382 electronvolt
mo.energy: -5.613 electronvolt
energy: -9.955 -9.955 -9.955 -4.382 -4.382 -9.955 -4.382 -9.955 -4.382 -9.955 -9.955 -9.955 -4.382 4.723 -4.382 -9.955 4.723 -4.382 electronvolt
mo.energy: -5.524 electronvolt
energy: -9.955 -9.955 -9.955 -9.955 -4.382 -9.955 -9.955 -9.955 -4.382 -6.463 4.723 -4.382 -4.382 4.723 1.678 -4.382 -9.955 -4.382 -4.382 4.723 -6.463 -6.463 4.723 electronvolt
mo.energy: -5.425 electronvolt
energy: -9.955 -9.955 -9.955 -4.382 -4.382 4.723 -9.955 -9.955 -9.955 -9.955 4.723 -4.382 -4.382 -6.463 -6.463 -6.463 electronvolt
mo.energy: -5.379 electronvolt
energy: -9.955 -9.955 -9.955 -4.382 -4.382 -4.382 -9.955 -9.955 -9.955 -6.463 -9.955 -6.463 -9.955 4.723 -9.955 1.678 -9.955 4.723 4.723 -9.955 1.678 -4.382 electronvolt
mo.energy: -5.015 electronvolt
energy: -9.955 -9.955 -4.382 -9.955 -9.955 -4.382 -9.955 -4.382 -9.955 -9.955 -4.382 2.299 -9.955 -3.913 -9.955 -9.955 -9.955 electronvolt
mo.energy: -4.989 electronvolt
energy: -9.955 -9.955 -9.955 -9.955 -4.382 -4.382 -9.955 -4.382 -9.955 -9.955 -4.382 -4.382 -4.382 -9.955 -4.382 -3.913 -4.382 -9.955 2.299 -4.382 -9.955 -9.955 -9.955 electronvolt
mo.energy: -4.913 electronvolt
energy: -9.955 -9.955 -9.955 -9.955 -9.955 -4.382 -4.382 -4.382 -9.955 -4.382 -4.382 -9.955 -9.955 -9.955 -4.382 -9.955 2.299 -4.382 -9.955 -3.913 -4.382 -9.955 -9.955 -9.955 electronvolt
mo.energy: -4.819 electronvolt
energy: -9.955 -4.382 -9.955 -9.955 -9.955 -9.955 -9.955 -9.955 -4.382 4.723 -9.955 -4.382 -4.382 -4.382 -9.955 -4.382 -4.382 -9.955 electronvolt
mo.energy: -4.757 electronvolt
energy: -9.955 -9.955 -4.382 -9.955 -9.955 4.723 -4.382 -9.955 -9.955 -9.955 -9.955 -4.382 -9.955 -9.955 -4.382 -4.382 electronvolt
mo.energy: -4.690 electronvolt
energy: -9.955 -9.955 -9.955 -4.382 -4.382 -9.955 -4.382 -9.955 -9.955 4.723 -4.382 -9.955 4.723 -4.382 -4.382 electronvolt
mo.energy: -4.631 electronvolt
energy: -9.955 -4.382 -9.955 -9.955 -9.955 -9.955 -9.955 -9.955 -9.955 -4.382 4.723 -4.382 -9.955 -4.382 -9.955 -4.382 -4.382 -9.955 electronvolt
mo.energy: -4.518 electronvolt
energy: -9.955 -9.955 -9.955 -9.955 -9.955 -9.955 -9.955 -9.955 -4.382 -9.955 -9.955 -9.955 -6.463 -9.955 -4.382 4.723 -27.198 1.678 -4.382 electronvolt
mo.energy: -4.497 electronvolt
energy: -9.955 -9.955 -4.382 -4.382 -4.382 -9.955 -9.955 -9.955 -4.382 -9.955 -9.955 -4.382 -9.955 -9.955 -9.955 -9.955 -9.955 -9.955 -4.382 -9.955 -9.955 4.723 -4.382 -9.955 -4.382 electronvolt
mo.energy: -4.470 electronvolt
energy: -9.955 -9.955 -9.955 -9.955 -9.955 -9.955 -9.955 -9.955 -4.382 -4.382 -9.955 -4.382 -4.382 -9.955 -9.955 -9.955 -6.463 -9.955 -9.955 -4.382 1.678 -4.382 electronvolt
mo.energy: -4.356 electronvolt
energy: -9.955 -9.955 -4.382 -4.382 -9.955 -9.955 -9.955 -9.955 4.723 -9.955 -4.382 -9.955 -4.382 4.723 -9.955 -4.382 electronvolt
mo.energy: -4.290 electronvolt
energy: -9.955 -9.955 -9.955 -9.955 -9.955 -4.382 -9.955 -9.955 -9.955 -9.955 -4.382 -4.382 -4.382 -9.955 -4.382 -4.382 -9.955 4.723 electronvolt
mo.energy: -4.095 electronvolt
energy: -9.955 -9.955 -9.955 -9.955 -9.955 -4.382 -9.955 -9.955 -9.955 -4.382 -9.955 -4.382 -9.955 -4.382 -4.382 2.299 -9.955 -4.382 -9.955 0.094 0.094 -9.955 0.094 -4.382 -4.382 -9.955 4.723 -9.955 -3.913 electronvolt
mo.energy: -4.062 electronvolt
energy: -9.955 -9.955 -9.955 -9.955 -9.955 -9.955 -4.382 -9.955 -4.382 -9.955 -4.382 -9.955 -4.382 -9.955 -9.955 -9.955 -9.955 -4.382 -4.382 4.723 11.469 electronvolt
mo.energy: -4.035 electronvolt
energy: -9.955 -9.955 -9.955 -9.955 -9.955 -4.382 -4.382 -9.955 -4.382 -9.955 -9.955 -4.382 -9.955 -4.382 -4.382 -4.382 -9.955 -9.955 -9.955 -9.955 -9.955 -4.382 -4.382 electronvolt
mo.energy: -4.000 electronvolt
energy: -9.955 -4.382 -9.955 -9.955 -9.955 -9.955 -9.955 -9.955 -9.955 -4.382 -4.382 -9.955 -9.955 4.723 -9.955 -9.955 -9.955 -4.382 -4.382 -9.955 -9.955 electronvolt
mo.energy: -3.832 electronvolt
energy: -9.955 -9.955 -9.955 -9.955 -4.382 -4.382 -9.955 -9.955 -9.955 -4.382 -4.382 -4.382 -9.955 -9.955 -9.955 -4.382 -9.955 -9.955 -4.382 -9.955 0.094 -9.955 electronvolt
mo.energy: -3.810 electronvolt
energy: -9.955 -9.955 -4.382 -9.955 -9.955 -9.955 -9.955 -9.955 -9.955 0.094 -4.382 -9.955 -4.382 -9.955 -4.382 -4.382 -3.913 -9.955 -9.955 -9.955 -9.955 2.299 -4.382 0.094 -6.463 -4.382 -9.955 -9.955 -27.198 -4.382 electronvolt
mo.energy: -3.712 electronvolt
energy: -9.955 -4.382 -9.955 -9.955 -9.955 -4.382 -4.382 -9.955 -9.955 -9.955 -9.955 -9.955 -9.955 -9.955 -9.955 -9.955 -9.955 -9.955 -9.955 -9.955 -4.382 -4.382 -9.955 4.723 electronvolt
mo.energy: -3.704 electronvolt
energy: -9.955 -4.382 -9.955 -9.955 -9.955 -4.382 -9.955 -9.955 -9.955 -4.382 -4.382 -9.955 -9.955 -9.955 -9.955 -9.955 -9.955 -27.198 4.723 -9.955 -9.955 -9.955 electronvolt
mo.energy: -3.487 electronvolt
energy: -9.955 -9.955 -4.382 -4.382 -9.955 -9.955 -4.382 -9.955 -9.955 -9.955 -9.955 -9.955 -4.382 -9.955 -9.955 -9.955 -4.382 -4.382 -9.955 -4.382 -27.198 electronvolt
mo.energy: -3.455 electronvolt
energy: -4.382 -9.955 -9.955 -9.955 -9.955 -9.955 -4.382 -9.955 -9.955 -9.955 -9.955 -9.955 -9.955 -9.955 -9.955 -9.955 -9.955 -4.382 -9.955 0.094 -4.382 -9.955 -4.382 -4.382 4.723 electronvolt
mo.energy: -3.432 electronvolt
energy: -4.382 -4.382 -9.955 -9.955 -9.955 -9.955 -9.955 -9.955 -9.955 -4.382 -9.955 -9.955 -4.382 -9.955 -9.955 -9.955 -9.955 -9.955 -9.955 -4.382 -4.382 -4.382 -4.382 -9.955 electronvolt
mo.energy: -3.316 electronvolt
energy: -9.955 -4.382 -4.382 -9.955 -9.955 -9.955 -9.955 -4.382 -9.955 -4.382 -9.955 -9.955 -9.955 -4.382 -9.955 -4.382 -9.955 -9.955 -9.955 -9.955 -9.955 -9.955 -9.955 -9.955 electronvolt
mo.energy: -3.200 electronvolt
energy: -4.382 -9.955 -9.955 -9.955 -4.382 -9.955 -9.955 -4.382 -9.955 -9.955 -4.382 -9.955 -9.955 -9.955 -9.955 -9.955 -9.955 -9.955 -9.955 -9.955 -4.382 -4.382 electronvolt
mo.energy: -3.188 electronvolt
energy: -4.382 -9.955 -9.955 -9.955 -9.955 -9.955 -4.382 -9.955 -9.955 -9.955 -4.382 -4.382 -9.955 -9.955 -9.955 -9.955 -4.382 -9.955 -9.955 -9.955 -9.955 -9.955 -9.955 -9.955 electronvolt
mo.energy: -3.096 electronvolt
energy: -9.955 -4.382 -9.955 -9.955 -9.955 -9.955 -9.955 -9.955 -9.955 -9.955 -4.382 -9.955 -4.382 -9.955 -4.382 -4.382 -4.382 -9.955 -9.955 -4.382 -9.955 electronvolt
mo.energy: -2.998 electronvolt
energy: -9.955 -4.382 -9.955 -9.955 -9.955 -4.382 -9.955 -9.955 -4.382 -9.955 -9.955 -9.955 -4.382 -9.955 -4.382 -9.955 -9.955 -4.382 -9.955 -9.955 -9.955 electronvolt
mo.energy: -2.992 electronvolt
energy: -9.955 -9.955 -9.955 -9.955 -4.382 -9.955 -9.955 -9.955 -4.382 -9.955 -4.382 -4.382 -9.955 -9.955 -4.382 -9.955 -4.382 -4.382 -9.955 -4.382 -9.955 -4.382 -9.955 -9.955 electronvolt
mo.energy: -2.860 electronvolt
energy: -9.955 -9.955 -9.955 -4.382 -9.955 -9.955 -9.955 -4.382 -9.955 -9.955 -9.955 -9.955 -9.955 -4.382 -9.955 -9.955 -4.382 -4.382 -4.382 -4.382 -4.382 -27.198 4.723 -9.955 -9.955 electronvolt
mo.energy: -2.726 electronvolt
energy: -9.955 -9.955 -4.382 -9.955 -9.955 -9.955 -4.382 -9.955 -9.955 -9.955 -9.955 -9.955 -9.955 -9.955 -9.955 -9.955 -4.382 -9.955 -9.955 -4.382 -9.955 -9.955 electronvolt
mo.energy: -2.705 electronvolt
energy: -9.955 -9.955 -9.955 -4.382 -9.955 -9.955 -9.955 -9.955 -9.955 -9.955 -4.382 -9.955 -9.955 -4.382 -4.382 -9.955 -9.955 -9.955 -9.955 -4.382 -9.955 -9.955 -4.382 -9.955 electronvolt
mo.energy: -2.690 electronvolt
energy: -9.955 -9.955 -9.955 -9.955 -9.955 -9.955 -9.955 -9.955 -9.955 -9.955 -4.382 -4.382 -9.955 -4.382 -9.955 -9.955 -9.955 -4.382 -9.955 -9.955 -27.198 -4.382 electronvolt
mo.energy: -2.681 electronvolt
energy: -9.955 -4.382 -9.955 -9.955 -9.955 -9.955 -9.955 -9.955 -4.382 -9.955 -9.955 -9.955 -4.382 -4.382 -4.382 -9.955 electronvolt
mo.energy: -2.647 electronvolt
energy: -9.955 -9.955 -9.955 -9.955 -9.955 -9.955 -9.955 -4.382 -9.955 -9.955 -9.955 -4.382 -4.382 -9.955 -4.382 -4.382 -9.955 -9.955 -4.382 -9.955 -9.955 -4.382 -27.198 -4.382 -9.955 electronvolt
mo.energy: -2.617 electronvolt
energy: -9.955 -9.955 -9.955 -9.955 -9.955 -9.955 -4.382 -4.382 -4.382 -4.382 -9.955 -9.955 -9.955 -9.955 -9.955 -9.955 -9.955 -9.955 -9.955 -4.382 -4.382 -27.198 -9.955 electronvolt
mo.energy: -2.609 electronvolt
energy: -9.955 -9.955 -9.955 -9.955 -9.955 -4.382 -9.955 -9.955 -9.955 -9.955 -4.382 -9.955 -4.382 -9.955 -9.955 -9.955 -9.955 -9.955 -4.382 -9.955 -4.382 -9.955 -9.955 -9.955 -4.382 electronvolt
mo.energy: -2.531 electronvolt
energy: -9.955 -9.955 -9.955 -9.955 -9.955 -9.955 -9.955 -9.955 -9.955 -9.955 -9.955 -4.382 -4.382 -9.955 -4.382 -4.382 -9.955 -9.955 electronvolt
mo.energy: -2.530 electronvolt
energy: -9.955 -9.955 -9.955 -9.955 -9.955 -9.955 -4.382 -9.955 -9.955 -9.955 -9.955 -4.382 -4.382 -9.955 -9.955 electronvolt
mo.energy: -2.474 electronvolt
energy: -9.955 -9.955 -9.955 -9.955 -9.955 -9.955 -9.955 -9.955 -4.382 -9.955 -9.955 -4.382 -9.955 -9.955 -4.382 -9.955 -4.382 -4.382 -9.955 -6.463 -9.955 -9.955 electronvolt
mo.energy: -2.447 electronvolt
energy: -9.955 -9.955 -9.955 -9.955 -4.382 -9.955 -9.955 -9.955 -9.955 -4.382 -9.955 -9.955 4.723 -9.955 -9.955 0.094 -9.955 -4.382 electronvolt
mo.energy: -2.404 electronvolt
energy: -9.955 -9.955 -9.955 -9.955 -9.955 -9.955 -9.955 -9.955 -4.382 -9.955 -4.382 -9.955 -4.382 -9.955 -9.955 -9.955 -9.955 -9.955 -4.382 -9.955 -9.955 -4.382 electronvolt
mo.energy: -2.282 electronvolt
energy: -9.955 -9.955 -9.955 -9.955 -4.382 -9.955 -9.955 -9.955 -4.382 -4.382 -9.955 -9.955 -9.955 -4.382 -4.382 -9.955 -27.198 -9.955 electronvolt
mo.energy: -2.253 electronvolt
energy: -9.955 -9.955 -4.382 -9.955 -9.955 -9.955 -9.955 -9.955 -9.955 -4.382 -4.382 -9.955 -4.382 -9.955 -9.955 -9.955 -4.382 -9.955 -9.955 -9.955 -4.382 -9.955 electronvolt
mo.energy: -2.232 electronvolt
energy: -9.955 -9.955 -9.955 -9.955 -9.955 -9.955 -9.955 -9.955 -9.955 -4.382 -4.382 -4.382 -9.955 -4.382 -9.955 -4.382 -9.955 -9.955 -9.955 -27.198 -4.382 -9.955 electronvolt
mo.energy: -2.127 electronvolt
energy: -9.955 -9.955 -9.955 -4.382 -9.955 -9.955 -9.955 -9.955 -9.955 -9.955 -4.382 -9.955 -9.955 -4.382 -9.955 -9.955 -4.382 4.723 -9.955 -9.955 -9.955 electronvolt
mo.energy: -2.119 electronvolt
energy: -9.955 -9.955 -4.382 -4.382 -9.955 -9.955 -9.955 -9.955 -4.382 -9.955 -4.382 -9.955 -9.955 -4.382 -9.955 -9.955 -9.955 -4.382 -9.955 -9.955 -9.955 -9.955 electronvolt
mo.energy: -2.097 electronvolt
energy: -9.955 -9.955 -4.382 -9.955 -9.955 -9.955 -9.955 -9.955 -9.955 -9.955 -9.955 -9.955 -9.955 -9.955 -4.382 -9.955 -4.382 -9.955 -9.955 -9.955 -4.382 -4.382 -4.382 -4.382 -9.955 electronvolt
mo.energy: -2.083 electronvolt
energy: -9.955 -9.955 -9.955 -9.955 -4.382 -9.955 -9.955 -4.382 -4.382 -9.955 -9.955 -9.955 -4.382 -9.955 -9.955 -4.382 -9.955 -9.955 -4.382 -9.955 electronvolt
mo.energy: -2.054 electronvolt
energy: -9.955 -9.955 -9.955 -4.382 -9.955 -9.955 -9.955 -9.955 -4.382 -9.955 -9.955 -9.955 -9.955 -4.382 -4.382 -9.955 -9.955 -4.382 -9.955 -9.955 -4.382 -4.382 -9.955 electronvolt
mo.energy: -2.016 electronvolt
energy: -9.955 -9.955 -9.955 -9.955 -4.382 -9.955 -9.955 -4.382 -9.955 -4.382 -9.955 -9.955 -9.955 -4.382 -9.955 -9.955 -9.955 -9.955 -4.382 -9.955 -9.955 -4.382 electronvolt
mo.energy: -1.999 electronvolt
energy: -9.955 -9.955 -9.955 -9.955 -9.955 -9.955 -4.382 -9.955 -4.382 -9.955 -9.955 -9.955 -9.955 -9.955 -9.955 -9.955 -4.382 -27.198 -27.198 -4.382 electronvolt
mo.energy: -1.988 electronvolt
energy: -9.955 -9.955 -9.955 -4.382 -9.955 -9.955 -9.955 -9.955 -9.955 -9.955 -4.382 -9.955 -9.955 -4.382 -4.382 -9.955 -4.382 -4.382 -27.198 electronvolt
mo.energy: -1.948 electronvolt
energy: -9.955 -4.382 -9.955 -9.955 -9.955 -9.955 -9.955 -9.955 -9.955 -9.955 -9.955 -9.955 -9.955 -9.955 -4.382 -4.382 -9.955 -4.382 -9.955 electronvolt
mo.energy: -1.911 electronvolt
energy: -9.955 -9.955 -9.955 -9.955 -4.382 -9.955 -4.382 -9.955 -4.382 -9.955 -9.955 -9.955 -9.955 -4.382 -9.955 -9.955 -9.955 electronvolt
mo.energy: -1.820 electronvolt
energy: -9.955 -9.955 -9.955 -9.955 -9.955 -9.955 -9.955 -9.955 -4.382 -9.955 -9.955 -9.955 -9.955 -9.955 -4.382 -9.955 -4.382 -9.955 -4.382 -9.955 electronvolt
mo.energy: -1.768 electronvolt
energy: -9.955 -9.955 -9.955 -9.955 -9.955 -9.955 -9.955 -9.955 -9.955 -9.955 -9.955 -9.955 -9.955 -4.382 -9.955 -4.382 -9.955 -4.382 -4.382 -4.382 -9.955 -4.382 electronvolt
mo.energy: -1.695 electronvolt
energy: -9.955 -9.955 -9.955 -9.955 -4.382 -9.955 -9.955 -9.955 -4.382 -9.955 -9.955 -4.382 -4.382 -4.382 -9.955 -4.382 -9.955 -9.955 -9.955 -9.955 -4.382 electronvolt
mo.energy: -1.644 electronvolt
energy: -9.955 -9.955 -9.955 -9.955 -9.955 -4.382 -9.955 -4.382 -9.955 -9.955 -4.382 -4.382 -9.955 -4.382 -9.955 -9.955 -4.382 -4.382 electronvolt
mo.energy: -1.585 electronvolt
energy: -9.955 -9.955 -9.955 -9.955 -4.382 -4.382 -4.382 -9.955 -4.382 -4.382 -4.382 -4.382 -9.955 electronvolt
mo.energy: -1.561 electronvolt
energy: -9.955 -9.955 -9.955 -9.955 -9.955 -9.955 -9.955 -9.955 -4.382 -4.382 -4.382 -4.382 -4.382 -4.382 -9.955 electronvolt
mo.energy: -1.530 electronvolt
energy: -9.955 -9.955 -9.955 -9.955 -9.955 -9.955 -9.955 -9.955 -9.955 -4.382 -9.955 -9.955 -4.382 -9.955 -9.955 -27.198 -27.198 electronvolt
mo.energy: -1.514 electronvolt
energy: -9.955 -9.955 -9.955 -9.955 -9.955 -9.955 -9.955 -4.382 -9.955 -27.198 electronvolt
energy: -9.955 -9.955 -9.955 -9.955 -9.955 -9.955 -9.955 -9.955 -9.955 -4.382 -9.955 -4.382 -4.382 -9.955 -9.955 -9.955 -9.955 -9.955 -9.955 -4.382 -9.955 electronvolt
mo.energy: -1.378 electronvolt
energy: -9.955 -9.955 -9.955 -9.955 -9.955 -9.955 -4.382 -9.955 -9.955 -9.955 -9.955 -9.955 -9.955 -4.382 -9.955 -9.955 -4.382 -9.955 -9.955 electronvolt
mo.energy: -1.300 electronvolt
energy: -9.955 -9.955 -9.955 -9.955 -9.955 -9.955 -9.955 -9.955 -9.955 -9.955 -9.955 0.094 -9.955 electronvolt
mo.energy: -1.279 electronvolt
energy: -9.955 -9.955 -9.955 -9.955 -9.955 -9.955 -9.955 -9.955 -9.955 -9.955 -9.955 -9.955 -9.955 -9.955 -9.955 -9.955 0.094 -9.955 -4.382 -4.382 electronvolt
mo.energy: -1.194 electronvolt
energy: -9.955 -9.955 -9.955 -9.955 -9.955 -9.955 -9.955 -9.955 -9.955 -9.955 -9.955 -9.955 -9.955 -9.955 0.094 -9.955 -9.955 electronvolt
mo.energy: -1.125 electronvolt
energy: -9.955 -9.955 -9.955 -9.955 -9.955 -9.955 -9.955 -9.955 -9.955 -9.955 -9.955 -9.955 -9.955 -9.955 -9.955 -9.955 -9.955 -9.955 -9.955 -4.382 -9.955 -9.955 -9.955 -9.955 0.094 electronvolt
mo.energy: -1.104 electronvolt
energy: -9.955 -9.955 -9.955 -9.955 -9.955 -9.955 -9.955 -9.955 -4.382 -4.382 -9.955 -9.955 -9.955 -9.955 -4.382 -9.955 -9.955 -9.955 -9.955 -9.955 0.094 -9.955 -9.955 electronvolt
mo.energy: -1.079 electronvolt
energy: -9.955 -9.955 -9.955 -9.955 -9.955 -9.955 -9.955 -9.955 -9.955 -9.955 -9.955 -9.955 -9.955 -9.955 -9.955 -9.955 -9.955 -9.955 -9.955 electronvolt
mo.energy: -1.041 electronvolt
energy: -9.955 -9.955 -9.955 -9.955 -9.955 -9.955 -9.955 11.469 -9.955 -9.955 -9.955 -9.955 electronvolt
mo.energy: -1.003 electronvolt
energy: -9.955 -9.955 -9.955 -9.955 -9.955 -9.955 -9.955 -9.955 -9.955 -9.955 -9.955 -9.955 -9.955 -9.955 -9.955 4.723 electronvolt
mo.energy: -0.936 electronvolt
energy: -9.955 -9.955 -9.955 -9.955 -9.955 -9.955 -9.955 -9.955 -9.955 -9.955 11.469 -9.955 electronvolt
mo.energy: -0.837 electronvolt
energy: -9.955 -9.955 -9.955 -9.955 -9.955 -9.955 -9.955 -9.955 -9.955 -4.382 -9.955 -9.955 -4.382 -4.382 -9.955 -4.382 -9.955 -9.955 -9.955 -9.955 electronvolt
mo.energy: -0.717 electronvolt
energy: -9.955 -9.955 -9.955 -9.955 -9.955 -9.955 -9.955 -9.955 -9.955 -9.955 -9.955 -9.955 -9.955 -9.955 -9.955 -9.955 0.094 -9.955 0.094 -9.955 0.094 -9.955 -9.955 electronvolt
mo.energy: -0.630 electronvolt
energy: -9.955 -9.955 -9.955 -9.955 -9.955 -9.955 -9.955 -9.955 -9.955 -9.955 -9.955 -9.955 -9.955 -4.382 -9.955 -9.955 -9.955 -9.955 electronvolt
mo.energy: -0.577 electronvolt
energy: -9.955 -9.955 -9.955 -9.955 -9.955 -9.955 -9.955 -9.955 -9.955 -9.955 -9.955 -9.955 -9.955 -9.955 -9.955 -9.955 -9.955 electronvolt
mo.energy: -0.554 electronvolt
energy: -9.955 -9.955 -9.955 -9.955 -9.955 -9.955 -9.955 -9.955 -9.955 -9.955 -9.955 -9.955 -9.955 -9.955 -9.955 -9.955 electronvolt
mo.energy: -0.420 electronvolt
energy: -9.955 -9.955 -9.955 -9.955 -9.955 -9.955 -9.955 -4.382 -9.955 -4.382 -9.955 -9.955 -9.955 -9.955 -4.382 -9.955 -9.955 -9.955 -4.382 -4.382 electronvolt
mo.energy: -0.357 electronvolt
energy: -9.955 -9.955 -9.955 -9.955 -9.955 -9.955 -9.955 -9.955 -9.955 -9.955 -9.955 -9.955 -9.955 -9.955 -9.955 -9.955 -9.955 -9.955 electronvolt
mo.energy: -0.310 electronvolt
mo.energy: -0.163 electronvolt
mo.energy: -0.091 electronvolt
energy: -9.955 -9.955 -9.955 -9.955 -9.955 -9.955 -9.955 -9.955 -9.955 -9.955 -9.955 -9.955 -9.955 -9.955 -9.955 -4.382 -9.955 electronvolt
mo.energy: -0.083 electronvolt
mo.energy: -0.047 electronvolt
mo.energy: -0.046 electronvolt
mo.energy: -0.008 electronvolt
mo.energy: 0.074 electronvolt
energy: -9.955 -9.955 -9.955 -9.955 -9.955 -9.955 -9.955 -9.955 -9.955 -9.955 -9.955 -9.955 -9.955 -9.955 -9.955 electronvolt
mo.energy: 0.123 electronvolt
mo.energy: 0.162 electronvolt
mo.energy: 0.190 electronvolt
mo.energy: 0.212 electronvolt
mo.energy: 0.230 electronvolt
mo.energy: 0.262 electronvolt
energy: -9.955 -9.955 -9.955 -9.955 -9.955 -9.955 -9.955 -9.955 -9.955 -9.955 -9.955 -9.955 -9.955 electronvolt
mo.energy: 0.276 electronvolt
mo.energy: 0.318 electronvolt
mo.energy: 0.320 electronvolt
mo.energy: 0.396 electronvolt
mo.energy: 0.437 electronvolt
mo.energy: 0.442 electronvolt
mo.energy: 0.444 electronvolt
energy: -9.955 -9.955 -9.955 -9.955 -9.955 -9.955 -9.955 -9.955 -9.955 -9.955 -9.955 -9.955 -9.955 -9.955 -9.955 -9.955 -9.955 -9.955 -9.955 -9.955 electronvolt
mo.energy: 0.455 electronvolt
mo.energy: 0.481 electronvolt
mo.energy: 0.551 electronvolt
mo.energy: 0.563 electronvolt
mo.energy: 0.601 electronvolt
energy: -9.955 -9.955 -9.955 -9.955 -9.955 -9.955 -9.955 -9.955 -9.955 electronvolt
mo.energy: 0.619 electronvolt
energy: -9.955 -9.955 -9.955 -9.955 -9.955 -9.955 -9.955 -9.955 -9.955 -4.382 -9.955 electronvolt
mo.energy: 0.626 electronvolt
mo.energy: 0.664 electronvolt
mo.energy: 0.713 electronvolt
mo.energy: 0.948 electronvolt
energy: -9.955 -9.955 -9.955 -9.955 -9.955 -9.955 -9.955 -9.955 -9.955 -9.955 electronvolt
mo.energy: 0.992 electronvolt
energy: -9.955 -9.955 -9.955 -9.955 -9.955 -9.955 -9.955 -9.955 -9.955 -9.955 10.811 -9.955 electronvolt
energy: -9.955 -9.955 -9.955 -9.955 -9.955 -9.955 -9.955 -9.955 -9.955 -9.955 -9.955 -9.955 electronvolt
mo.energy: 5.719 electronvolt
energy: -4.382 -4.382 -4.382 -9.955 -4.382 -9.955 -4.382 -9.955 -9.955 -4.382 4.723 -9.955 electronvolt
mo.energy: 6.037 electronvolt
energy: -4.382 -4.382 -4.382 -9.955 -9.955 -9.955 -4.382 -9.955 -9.955 -4.382 -4.382 -9.955 -4.382 -4.382 -4.382 electronvolt
mo.energy: 6.326 electronvolt
energy: -4.382 -4.382 -4.382 -4.382 -4.382 -9.955 -9.955 -9.955 -9.955 -4.382 -9.955 -4.382 -4.382 -9.955 electronvolt
mo.energy: 6.458 electronvolt
energy: -4.382 -4.382 -4.382 -9.955 -9.955 -9.955 -4.382 -4.382 -4.382 -9.955 electronvolt
mo.energy: 6.527 electronvolt
energy: -4.382 -4.382 -4.382 -9.955 -4.382 -9.955 -4.382 -4.382 -9.955 -4.382 -9.955 -4.382 -9.955 -9.955 -4.382 -9.955 electronvolt
mo.energy: 6.640 electronvolt
energy: -4.382 -4.382 -4.382 -9.955 -4.382 -9.955 -9.955 -9.955 -4.382 -9.955 -9.955 -4.382 -4.382 -9.955 -9.955 electronvolt
mo.energy: 6.916 electronvolt
energy: -4.382 -4.382 -4.382 -4.382 -9.955 -4.382 -4.382 -4.382 -4.382 -4.382 -9.955 -9.955 -9.955 -9.955 -9.955 -9.955 -9.955 -9.955 -9.955 electronvolt
mo.energy: 7.205 electronvolt
energy: -4.382 -4.382 -4.382 -9.955 -9.955 -9.955 -4.382 -4.382 -9.955 -9.955 -4.382 -4.382 -9.955 -4.382 -4.382 -4.382 electronvolt
mo.energy: 7.248 electronvolt
energy: -4.382 -4.382 -4.382 -4.382 -9.955 -4.382 -4.382 -9.955 -9.955 -4.382 -9.955 -9.955 -9.955 -9.955 -4.382 electronvolt
mo.energy: 7.275 electronvolt
energy: -4.382 -4.382 -9.955 -4.382 -4.382 -9.955 -9.955 -4.382 -9.955 -4.382 -4.382 -4.382 4.723 -4.382 -9.955 electronvolt
mo.energy: 7.349 electronvolt
energy: -4.382 -4.382 -4.382 -9.955 -9.955 -4.382 -9.955 -4.382 -9.955 -9.955 -4.382 -4.382 4.723 -9.955 electronvolt
mo.energy: 7.354 electronvolt
energy: -4.382 -4.382 -4.382 -9.955 -4.382 -9.955 -4.382 -9.955 -9.955 -9.955 -9.955 -4.382 -4.382 -9.955 -9.955 -4.382 electronvolt
mo.energy: 7.409 electronvolt
energy: -4.382 -4.382 -4.382 -9.955 -4.382 -4.382 -4.382 -4.382 -9.955 -4.382 -9.955 -9.955 -9.955 4.723 -9.955 -9.955 -9.955 -9.955 -9.955 -9.955 electronvolt
mo.energy: 7.466 electronvolt
energy: -4.382 -4.382 -4.382 -9.955 -4.382 -9.955 -4.382 -9.955 -9.955 -9.955 -4.382 -4.382 -4.382 -9.955 electronvolt
mo.energy: 7.640 electronvolt
energy: -4.382 -4.382 -9.955 -4.382 -4.382 -4.382 -4.382 -9.955 -4.382 -9.955 -4.382 -4.382 -9.955 -9.955 -9.955 -9.955 4.723 -9.955 -9.955 -9.955 electronvolt
mo.energy: 7.665 electronvolt
energy: -4.382 -4.382 -4.382 -9.955 -4.382 -9.955 -9.955 -9.955 -9.955 -4.382 -4.382 -9.955 4.723 electronvolt
mo.energy: 7.685 electronvolt
energy: -4.382 -4.382 -9.955 -4.382 -9.955 -4.382 -4.382 -9.955 4.723 -4.382 -9.955 -9.955 -9.955 -9.955 -4.382 -4.382 -9.955 -9.955 electronvolt
mo.energy: 7.732 electronvolt
energy: -4.382 -4.382 -4.382 -4.382 -9.955 -4.382 -9.955 -4.382 -9.955 -4.382 -9.955 -9.955 -4.382 -9.955 -9.955 -9.955 -4.382 -9.955 -9.955 -4.382 4.723 -9.955 electronvolt
mo.energy: 7.738 electronvolt
energy: -4.382 -4.382 -4.382 -4.382 -9.955 -4.382 -4.382 -4.382 -9.955 -9.955 -9.955 -9.955 -9.955 -9.955 -9.955 -9.955 4.723 4.723 -9.955 electronvolt
mo.energy: 7.887 electronvolt
energy: -4.382 -4.382 -9.955 -4.382 -9.955 -9.955 -9.955 -4.382 -9.955 -4.382 -9.955 -9.955 4.723 4.723 4.723 10.811 electronvolt
mo.energy: 7.903 electronvolt
energy: -4.382 -4.382 -9.955 -4.382 -4.382 -4.382 -4.382 -4.382 -4.382 -4.382 -9.955 -9.955 -9.955 -9.955 -9.955 -4.382 -9.955 -9.955 -9.955 -9.955 4.723 electronvolt
mo.energy: 8.067 electronvolt
energy: -4.382 -4.382 -4.382 -4.382 -4.382 -9.955 -9.955 -4.382 -9.955 -9.955 -4.382 -9.955 -9.955 -4.382 -9.955 4.723 -4.382 -9.955 electronvolt
mo.energy: 8.154 electronvolt
energy: -4.382 -4.382 -4.382 -4.382 -9.955 -4.382 -9.955 -9.955 -9.955 -9.955 -4.382 -9.955 -4.382 -4.382 4.723 -9.955 -4.382 4.723 -9.955 -4.382 4.723 -9.955 electronvolt
mo.energy: 8.395 electronvolt
energy: -4.382 -4.382 -4.382 -9.955 -9.955 -9.955 -9.955 -4.382 -4.382 -9.955 4.723 -4.382 -6.463 -9.955 -9.955 -9.955 4.723 0.094 -4.382 electronvolt
mo.energy: 8.505 electronvolt
energy: -4.382 -4.382 -9.955 -4.382 -4.382 4.723 -9.955 -9.955 -9.955 -9.955 4.723 -4.382 -9.955 -9.955 -6.463 -4.382 -9.955 -9.955 electronvolt
mo.energy: 8.559 electronvolt
energy: -4.382 -4.382 -4.382 -4.382 -9.955 -4.382 -4.382 -9.955 -9.955 -9.955 -9.955 -9.955 1.678 4.723 4.723 -9.955 4.723 -4.382 -4.382 -9.955 -6.463 -9.955 -9.955 -9.955 electronvolt
mo.energy: 8.586 electronvolt
energy: -4.382 -4.382 -4.382 -9.955 -4.382 -4.382 -9.955 -9.955 -9.955 -4.382 -4.382 -9.955 4.723 -9.955 4.723 -9.955 -9.955 -9.955 4.723 -9.955 -9.955 -4.382 -9.955 -4.382 4.723 -9.955 electronvolt
mo.energy: 8.611 electronvolt
energy: -4.382 -4.382 -4.382 -4.382 -4.382 -9.955 -9.955 -4.382 -9.955 -4.382 4.723 -9.955 -9.955 -4.382 -9.955 -9.955 -9.955 -9.955 -9.955 -9.955 -4.382 1.678 -4.382 -9.955 -9.955 electronvolt
mo.energy: 8.619 electronvolt
energy: -4.382 -9.955 -4.382 -9.955 -9.955 4.723 -9.955 -4.382 -4.382 -4.382 -4.382 -9.955 -9.955 -9.955 4.723 -9.955 1.678 electronvolt
mo.energy: 8.631 electronvolt
energy: -4.382 -4.382 -9.955 -4.382 -9.955 -9.955 -4.382 4.723 -9.955 -4.382 -4.382 -9.955 -9.955 4.723 -4.382 -4.382 -4.382 4.723 -9.955 1.678 1.678 -9.955 electronvolt
mo.energy: 8.635 electronvolt
energy: -4.382 -4.382 -9.955 4.723 -4.382 -4.382 -9.955 -9.955 -9.955 -9.955 -9.955 4.723 -9.955 -9.955 -4.382 1.678 electronvolt
mo.energy: 8.638 electronvolt
energy: -4.382 -4.382 -4.382 -9.955 -9.955 -9.955 -9.955 -4.382 -4.382 -9.955 4.723 4.723 -4.382 4.723 -9.955 -4.382 -4.382 -9.955 -4.382 4.723 -9.955 -9.955 -9.955 -9.955 electronvolt
mo.energy: 8.869 electronvolt
energy: -4.382 -4.382 -4.382 -9.955 -4.382 -9.955 -4.382 -4.382 -9.955 -9.955 -9.955 4.723 -4.382 -4.382 -9.955 -4.382 -9.955 -9.955 -9.955 -9.955 -9.955 electronvolt
mo.energy: 8.928 electronvolt
energy: -4.382 -4.382 -9.955 -9.955 -4.382 -4.382 -9.955 -4.382 -4.382 4.723 -4.382 -9.955 -9.955 -9.955 -9.955 -9.955 -9.955 4.723 -9.955 -27.198 electronvolt
mo.energy: 9.052 electronvolt
energy: -4.382 -4.382 -4.382 -9.955 -4.382 -9.955 -9.955 -4.382 -9.955 -4.382 -9.955 -9.955 -4.382 4.723 -9.955 -9.955 -9.955 -4.382 4.723 4.723 -4.382 -9.955 electronvolt
mo.energy: 9.154 electronvolt
energy: -4.382 -4.382 -4.382 -4.382 -9.955 -9.955 -9.955 -9.955 -4.382 4.723 -4.382 -9.955 -9.955 -9.955 -4.382 -4.382 -9.955 -9.955 4.723 4.723 -4.382 1.678 4.723 electronvolt
mo.energy: 9.345 electronvolt
energy: 1.678 1.678 1.678 1.678 -12.276 4.178 -6.463 23.286 electronvolt
mo.energy: 9.667 electronvolt
energy: 1.678 1.678 -6.463 2.299 -6.463 -3.913 1.678 0.094 -6.463 0.094 0.094 20.217 10.811 23.286 -4.382 electronvolt
mo.energy: 9.703 electronvolt
energy: 1.678 -6.463 2.299 1.678 -6.463 1.678 -3.913 -6.463 0.094 0.094 20.217 0.094 10.811 0.094 -4.382 16.116 23.286 electronvolt
mo.energy: 9.727 electronvolt
energy: 1.678 1.678 2.299 -6.463 1.678 -6.463 -6.463 -3.913 0.094 0.094 0.094 10.811 20.217 4.723 electronvolt
mo.energy: 9.936 electronvolt
energy: -4.382 -4.382 -4.382 1.678 -6.463 -4.382 1.678 -6.463 1.678 -9.955 -4.382 -4.382 -6.463 -6.463 -27.198 -27.198 -9.955 -9.955 -9.955 -9.955 0.094 -9.955 -9.955 electronvolt
mo.energy: 10.060 electronvolt
energy: -4.382 -4.382 -6.463 1.678 -4.382 -4.382 -4.382 0.094 -6.463 -4.382 -9.955 -27.198 -27.198 -27.198 -9.955 -9.955 -9.955 23.286 4.723 4.723 23.286 -9.955 electronvolt
mo.energy: 10.118 electronvolt
energy: 1.678 -4.382 -6.463 -4.382 -4.382 -12.276 1.678 -4.382 -4.382 -4.382 -6.463 -4.382 1.678 -9.955 -6.463 1.678 -6.463 -9.955 -9.955 -9.955 0.094 -9.955 4.178 -4.382 -4.382 0.094 -4.382 23.286 4.723 -9.955 -27.198 23.286 -9.955 electronvolt
mo.energy: 10.141 electronvolt
energy: -4.382 -4.382 -6.463 -6.463 -4.382 -4.382 0.094 -9.955 -27.198 -9.955 -4.382 -27.198 -9.955 0.094 -9.955 -6.463 -4.382 23.286 -9.955 -27.198 1.678 electronvolt
mo.energy: 10.175 electronvolt
energy: 1.678 -6.463 1.678 -6.463 -4.382 -4.382 0.094 0.094 -4.382 -4.382 -4.382 -4.382 1.678 -4.382 0.094 -4.382 0.094 -4.382 -9.955 4.723 electronvolt
mo.energy: 10.240 electronvolt
energy: 1.678 -6.463 1.678 -6.463 0.094 0.094 -4.382 -4.382 0.094 0.094 0.094 23.286 10.811 10.811 electronvolt
mo.energy: 10.325 electronvolt
energy: 1.678 -6.463 1.678 -6.463 -4.382 0.094 -4.382 0.094 4.723 -4.382 -4.382 10.811 0.094 0.094 10.811 10.811 -4.382 10.811 23.286 electronvolt
mo.energy: 10.352 electronvolt
energy: 1.678 -6.463 1.678 -6.463 -4.382 -4.382 -4.382 -4.382 1.678 0.094 0.094 -4.382 -4.382 -9.955 -6.463 0.094 -9.955 0.094 10.811 10.811 -9.955 -9.955 -9.955 -4.382 electronvolt
mo.energy: 10.370 electronvolt
energy: 1.678 -6.463 1.678 -6.463 1.678 -6.463 -4.382 0.094 0.094 0.094 0.094 -4.382 0.094 10.811 0.094 -3.913 -4.382 -4.382 4.723 10.811 electronvolt
mo.energy: 10.483 electronvolt
energy: -4.382 -4.382 0.094 -9.955 1.678 -9.955 1.678 -6.463 -4.382 -4.382 1.678 -9.955 -3.913 -27.198 -9.955 -9.955 -6.463 -9.955 10.811 -9.955 -9.955 electronvolt
mo.energy: 10.679 electronvolt
energy: -6.463 1.678 -6.463 1.678 -6.463 1.678 4.723 4.723 0.094 0.094 0.094 0.094 4.723 4.723 16.116 10.811 10.811 -4.382 -4.382 electronvolt
mo.energy: 10.721 electronvolt
energy: -6.463 -6.463 1.678 1.678 -4.382 0.094 0.094 4.723 4.723 10.811 4.723 0.094 -4.382 16.116 4.723 10.811 4.723 10.811 0.094 electronvolt
mo.energy: 10.742 electronvolt
energy: -6.463 1.678 -6.463 1.678 -4.382 0.094 4.723 -4.382 0.094 0.094 0.094 0.094 -4.382 16.116 -9.955 4.723 4.723 -4.382 electronvolt
mo.energy: 10.821 electronvolt
energy: -4.382 -4.382 -4.382 -4.382 -9.955 -4.382 -9.955 -9.955 -4.382 0.094 0.094 0.094 -9.955 -4.382 -9.955 -27.198 -9.955 -9.955 23.286 -9.955 -27.198 0.094 23.286 -9.955 -27.198 electronvolt
mo.energy: 10.939 electronvolt
energy: -4.382 -4.382 -4.382 -9.955 -4.382 -9.955 -4.382 -27.198 0.094 1.678 -6.463 -4.382 -9.955 0.094 -27.198 -4.382 -9.955 -9.955 -9.955 -9.955 -9.955 0.094 -9.955 -4.382 -9.955 -27.198 electronvolt
mo.energy: 10.960 electronvolt
energy: -4.382 -4.382 0.094 -9.955 -4.382 -4.382 -4.382 -4.382 -4.382 1.678 -9.955 1.678 -9.955 -27.198 -9.955 -9.955 -4.382 23.286 -9.955 -3.913 -4.382 1.678 -6.463 -6.463 10.811 -9.955 -4.382 -27.198 -9.955 electronvolt
mo.energy: 11.040 electronvolt
energy: -4.382 -4.382 -4.382 -9.955 0.094 -4.382 -4.382 -9.955 -9.955 -9.955 10.811 -3.913 -9.955 1.678 0.094 -9.955 1.678 10.811 -9.955 0.094 -6.463 -27.198 -4.382 -4.382 electronvolt
