program: AMS
programVersion: 2021.106
runtype: GEOMETRY OPTIMIZATION
method: DFT
functional: Becke88 Perdew86
functional: VWN
spinMolecule: Restricted
formula: O40PW12
InChI: InChI=1S/O4P.36O.12W/c1-5(2,3)4;;;;;;;;;;;;;;;;;;;;;;;;;;;;;;;;;;;;;;;;;;;;;;;;
53 atoms
P  0.000000 0.000000 0.000000
W  2.571591 2.571591 0.093929
W  -2.571591 2.571591 -0.093929
W  -2.571591 -2.571591 0.093929
W  2.571591 -2.571591 -0.093929
W  0.093929 2.571591 2.571591
W  -0.093929 -2.571591 2.571591
W  0.093929 -2.571591 -2.571591
W  -0.093929 2.571591 -2.571591
W  -2.571591 0.093929 -2.571591
W  2.571591 -0.093929 -2.571591
W  2.571591 0.093929 2.571591
W  -2.571591 -0.093929 2.571591
O  0.901064 0.901064 0.901064
O  -0.901064 0.901064 -0.901064
O  -0.901064 -0.901064 0.901064
O  0.901064 -0.901064 -0.901064
O  1.186966 1.186966 -3.054866
O  -1.186966 1.186966 3.054866
O  -1.186966 -1.186966 -3.054866
O  1.186966 -1.186966 3.054866
O  -3.054866 1.186966 1.186966
O  3.054866 -1.186966 1.186966
O  -3.054866 -1.186966 -1.186966
O  3.054866 1.186966 -1.186966
O  -1.186966 -3.054866 -1.186966
O  1.186966 3.054866 -1.186966
O  1.186966 -3.054866 1.186966
O  -1.186966 3.054866 1.186966
O  1.504116 1.504116 3.407320
O  -1.504116 1.504116 -3.407320
O  -1.504116 -1.504116 3.407320
O  1.504116 -1.504116 -3.407320
O  3.407320 1.504116 1.504116
O  -3.407320 -1.504116 1.504116
O  3.407320 -1.504116 -1.504116
O  -3.407320 1.504116 -1.504116
O  -1.504116 3.407320 -1.504116
O  1.504116 -3.407320 -1.504116
O  1.504116 3.407320 1.504116
O  -1.504116 -3.407320 1.504116
O  3.789347 3.789347 -0.184187
O  -3.789347 3.789347 0.184187
O  -3.789347 -3.789347 -0.184187
O  3.789347 -3.789347 0.184187
O  -0.184187 3.789347 3.789347
O  0.184187 -3.789347 3.789347
O  -0.184187 -3.789347 -3.789347
O  0.184187 3.789347 -3.789347
O  -3.789347 -0.184187 -3.789347
O  3.789347 0.184187 -3.789347
O  3.789347 -0.184187 3.789347
O  -3.789347 0.184187 3.789347
elementType: P W W W W W W W W W W W W O O O O O O O O O O O O O O O O O O O O O O O O O O O O O O O O O O O O O O O O
mdcq: 1.50628220 2.01322549 2.01322548 2.01322547 2.01322548 2.01322551 2.01322552 2.01322552 2.01322552 2.01322552 2.01322551 2.01322552 2.01322551 -0.82593178 -0.82593178 -0.82593178 -0.82593178 -0.76029781 -0.76029781 -0.76029781 -0.76029781 -0.76029820 -0.76029820 -0.76029820 -0.76029820 -0.76029820 -0.76029819 -0.76029820 -0.76029820 -0.75322920 -0.75322920 -0.75322920 -0.75322920 -0.75322900 -0.75322900 -0.75322900 -0.75322900 -0.75322900 -0.75322899 -0.75322900 -0.75322900 -0.59991118 -0.59991117 -0.59991117 -0.59991117 -0.59991136 -0.59991135 -0.59991135 -0.59991135 -0.59991135 -0.59991135 -0.59991135 -0.59991136
eener: -403.002162 electronvolt
kinener: 322.830631 electronvolt
coulombener: 12.376400 electronvolt
xcener: -375.959155 electronvolt
dispener: 0.000000 electronvolt
total: -443.754286 electronvolt
charge: 2.41256979 2.47454290 2.47454290 2.47454290 2.47454290 2.47454290 2.47454290 2.47454290 2.47454290 2.47454290 2.47454290 2.47454290 2.47454290 -1.03158575 -1.03158575 -1.03158575 -1.03158575 -0.93301236 -0.93301236 -0.93301236 -0.93301236 -0.93301236 -0.93301236 -0.93301236 -0.93301236 -0.93301236 -0.93301236 -0.93301236 -0.93301236 -0.92530962 -0.92530962 -0.92530962 -0.92530962 -0.92530962 -0.92530962 -0.92530962 -0.92530962 -0.92530962 -0.92530962 -0.92530962 -0.92530962 -0.72340647 -0.72340647 -0.72340647 -0.72340647 -0.72340647 -0.72340647 -0.72340647 -0.72340647 -0.72340647 -0.72340647 -0.72340647 -0.72340647
dipole: 0.00000000 0.00000000 -0.00000000
dipole: 0.000000
quadrupole: -0.00000000 -0.00000000 0.00000000 0.00000000 0.00000000 -0.00000000
charge: -3
converged: GEOMETRY CONVERGED
charge: 2.4126 2.4745 2.4745 2.4745 2.4745 2.4745 2.4745 2.4745 2.4745 2.4745 2.4745 2.4745 2.4745 -1.0316 -1.0316 -1.0316 -1.0316 -0.9330 -0.9330 -0.9330 -0.9330 -0.9330 -0.9330 -0.9330 -0.9330 -0.9330 -0.9330 -0.9330 -0.9330 -0.9253 -0.9253 -0.9253 -0.9253 -0.9253 -0.9253 -0.9253 -0.9253 -0.9253 -0.9253 -0.9253 -0.9253 -0.7234 -0.7234 -0.7234 -0.7234 -0.7234 -0.7234 -0.7234 -0.7234 -0.7234 -0.7234 -0.7234 -0.7234
mo.energy: -18.530 electronvolt
energy: -24.141 -5.576 -24.141 -5.836 10.272 -24.141 -24.141 -9.204 2.319 -24.141 electronvolt
mo.energy: -17.935 electronvolt
energy: -24.141 -24.141 -5.836 -24.141 -4.627 electronvolt
mo.energy: -17.579 electronvolt
energy: -24.141 -24.141 -24.141 -24.141 2.319 -24.141 -4.627 -4.627 electronvolt
mo.energy: -17.482 electronvolt
energy: -24.141 -24.141 -24.141 -24.141 -4.627 -4.627 -24.141 electronvolt
mo.energy: -17.217 electronvolt
energy: -24.141 -24.141 -4.627 -24.141 3.974 electronvolt
mo.energy: -17.082 electronvolt
energy: -24.141 -24.141 -4.627 3.974 -0.653 electronvolt
mo.energy: -16.868 electronvolt
energy: -24.141 -24.141 -24.141 -5.836 electronvolt
mo.energy: -16.832 electronvolt
energy: -24.141 -24.141 -24.141 -24.141 -4.627 -24.141 -5.836 electronvolt
mo.energy: -16.644 electronvolt
energy: -24.141 -24.141 -4.627 -4.627 electronvolt
mo.energy: -16.560 electronvolt
energy: -24.141 -24.141 -24.141 -4.627 -43.279 electronvolt
mo.energy: -16.511 electronvolt
energy: -24.141 -4.627 -4.627 -0.653 electronvolt
mo.energy: -16.499 electronvolt
energy: -24.141 -24.141 -4.627 -24.141 -4.627 -4.627 -43.279 electronvolt
mo.energy: -16.497 electronvolt
energy: -24.141 -4.627 -24.141 -4.627 -43.279 -9.204 electronvolt
mo.energy: -16.493 electronvolt
energy: -24.141 -4.627 -24.141 -24.141 -4.627 -43.279 -9.204 electronvolt
mo.energy: -16.482 electronvolt
energy: -24.141 -24.141 -4.627 -24.141 -4.627 -4.627 electronvolt
mo.energy: -16.437 electronvolt
energy: -24.141 -24.141 -24.141 -24.141 electronvolt
mo.energy: -8.631 electronvolt
energy: -9.204 -24.141 -14.129 3.299 -4.627 -9.204 9.644 -4.627 electronvolt
mo.energy: -6.408 electronvolt
energy: -9.204 -5.576 -9.204 2.319 -4.627 -24.141 -4.627 -4.627 -4.627 -9.204 -9.204 electronvolt
mo.energy: -6.252 electronvolt
energy: -4.627 -9.204 -9.204 3.974 -4.627 electronvolt
mo.energy: -6.174 electronvolt
energy: -9.204 -9.204 -4.627 -9.204 -9.204 -9.204 -9.204 -4.627 3.974 1.301 -5.836 3.974 -4.627 -4.627 electronvolt
mo.energy: -5.516 electronvolt
energy: -9.204 -4.627 -9.204 -4.627 -9.204 -9.204 -9.204 -9.204 -4.627 3.974 3.974 electronvolt
mo.energy: -5.418 electronvolt
energy: -9.204 -9.204 -4.627 -4.627 -4.627 -9.204 -4.627 -9.204 3.974 -9.204 1.301 15.125 -9.204 electronvolt
mo.energy: -5.379 electronvolt
energy: -9.204 -9.204 -9.204 -9.204 -4.627 -4.627 -4.627 3.974 -9.204 1.301 electronvolt
mo.energy: -5.071 electronvolt
energy: -4.627 -9.204 -9.204 -9.204 -4.627 -9.204 3.974 3.974 -4.627 electronvolt
mo.energy: -4.786 electronvolt
energy: -9.204 -4.627 -9.204 -9.204 -9.204 -4.627 -9.204 -9.204 -0.653 10.272 -9.204 -4.627 -9.204 2.319 -4.627 -24.141 -0.653 -4.627 -9.204 -9.204 electronvolt
mo.energy: -4.670 electronvolt
energy: -9.204 -4.627 -9.204 -9.204 -9.204 -9.204 -9.204 -9.204 -9.204 -4.627 3.974 10.272 -9.204 -24.141 -4.627 electronvolt
mo.energy: -4.546 electronvolt
energy: -4.627 -9.204 -9.204 -9.204 -4.627 -9.204 -4.627 -9.204 -4.627 3.974 -9.204 -9.204 -4.627 -9.204 -4.627 electronvolt
mo.energy: -4.307 electronvolt
energy: -4.627 -9.204 -9.204 -9.204 -4.627 -9.204 -4.627 3.974 3.299 electronvolt
mo.energy: -4.034 electronvolt
energy: -9.204 -4.627 -4.627 -9.204 -4.627 -9.204 -9.204 -9.204 -9.204 -9.204 -4.627 -9.204 -9.204 -9.204 -9.204 -4.627 3.974 electronvolt
mo.energy: -4.006 electronvolt
energy: -9.204 -4.627 -9.204 -9.204 -9.204 -9.204 -9.204 -4.627 -4.627 -9.204 -4.627 -9.204 -4.627 -9.204 -9.204 -24.141 electronvolt
mo.energy: -3.846 electronvolt
energy: -9.204 -9.204 -9.204 -4.627 -4.627 -4.627 -9.204 -4.627 -9.204 -9.204 -9.204 -9.204 -9.204 -9.204 -9.204 -9.204 -4.627 -9.204 electronvolt
mo.energy: -3.762 electronvolt
energy: -9.204 -9.204 -9.204 -9.204 -4.627 -9.204 -4.627 -9.204 -9.204 -9.204 -4.627 -4.627 -4.627 -24.141 -4.627 electronvolt
mo.energy: -3.559 electronvolt
energy: -9.204 -9.204 -4.627 -4.627 -9.204 -4.627 3.974 -9.204 -4.627 -9.204 -0.653 20.489 -24.141 -9.204 electronvolt
mo.energy: -3.518 electronvolt
energy: -9.204 -9.204 -4.627 -9.204 -9.204 -9.204 -9.204 -4.627 -4.627 -4.627 -9.204 -9.204 -9.204 -9.204 electronvolt
mo.energy: -3.422 electronvolt
energy: -9.204 -9.204 -9.204 -9.204 -9.204 -9.204 -4.627 -9.204 -9.204 -9.204 -9.204 -24.141 -4.627 -4.627 -4.627 -4.627 -4.627 electronvolt
mo.energy: -3.360 electronvolt
energy: -9.204 -9.204 -4.627 -9.204 -9.204 -4.627 -9.204 -4.627 -4.627 -9.204 -9.204 -9.204 -0.653 -4.627 -9.204 electronvolt
mo.energy: -3.353 electronvolt
energy: -9.204 -9.204 -9.204 -9.204 -4.627 -9.204 -4.627 -9.204 -4.627 -9.204 -9.204 -24.141 -9.204 10.272 3.974 3.974 electronvolt
mo.energy: -3.160 electronvolt
energy: -9.204 -4.627 -9.204 -4.627 -24.141 -24.141 -9.204 -9.204 -0.653 -9.204 -4.627 -14.129 -9.204 electronvolt
mo.energy: -3.043 electronvolt
energy: -9.204 -4.627 -9.204 -9.204 -9.204 -9.204 -9.204 -4.627 -9.204 -9.204 electronvolt
mo.energy: -3.006 electronvolt
energy: -9.204 -4.627 -9.204 -9.204 -9.204 -4.627 -24.141 -9.204 -4.627 electronvolt
mo.energy: -3.000 electronvolt
energy: -9.204 -9.204 -4.627 -4.627 -9.204 -9.204 -4.627 -9.204 -9.204 -9.204 -24.141 -9.204 -4.627 -9.204 -9.204 -9.204 3.974 electronvolt
mo.energy: -2.863 electronvolt
energy: -9.204 -4.627 -9.204 -9.204 -24.141 3.974 -9.204 -9.204 -9.204 -24.141 electronvolt
mo.energy: -2.726 electronvolt
energy: -9.204 -4.627 -9.204 -9.204 -4.627 3.974 9.644 electronvolt
mo.energy: -2.721 electronvolt
energy: -9.204 -9.204 -9.204 -9.204 -4.627 -9.204 -4.627 -4.627 -9.204 -9.204 -9.204 -9.204 -9.204 -4.627 -9.204 electronvolt
mo.energy: -2.660 electronvolt
energy: -9.204 -9.204 -4.627 -9.204 -9.204 -4.627 -9.204 -9.204 -0.653 -9.204 -9.204 electronvolt
mo.energy: -2.443 electronvolt
energy: -9.204 -9.204 -9.204 -9.204 -9.204 -9.204 -9.204 -4.627 -4.627 -4.627 -4.627 -9.204 20.489 electronvolt
mo.energy: -2.425 electronvolt
energy: -9.204 -9.204 -4.627 -9.204 -9.204 10.272 -9.204 -9.204 -9.204 -24.141 -9.204 electronvolt
mo.energy: -2.405 electronvolt
energy: -9.204 -9.204 -9.204 -4.627 -0.653 20.489 -43.279 electronvolt
mo.energy: -2.329 electronvolt
energy: -9.204 -9.204 -9.204 -9.204 10.272 -4.627 -4.627 -9.204 -4.627 3.974 -24.141 -9.204 electronvolt
mo.energy: -2.202 electronvolt
energy: -9.204 -9.204 -9.204 -9.204 -9.204 -0.653 3.974 -24.141 electronvolt
mo.energy: -2.011 electronvolt
energy: -9.204 -4.627 -9.204 -9.204 -9.204 -4.627 -9.204 -9.204 -9.204 -9.204 electronvolt
mo.energy: -1.954 electronvolt
energy: -9.204 -9.204 -9.204 -9.204 -9.204 -0.653 electronvolt
mo.energy: -1.638 electronvolt
energy: -9.204 -9.204 -9.204 -9.204 -9.204 -9.204 -9.204 -9.204 electronvolt
mo.energy: -1.503 electronvolt
energy: -9.204 -9.204 -9.204 -9.204 -9.204 -9.204 -9.204 -9.204 -9.204 -9.204 -9.204 -9.204 electronvolt
mo.energy: -1.366 electronvolt
energy: -9.204 -9.204 -9.204 -9.204 -9.204 -9.204 -9.204 -9.204 -9.204 -9.204 -9.204 -0.653 -9.204 electronvolt
mo.energy: -1.132 electronvolt
energy: -9.204 -9.204 -9.204 -9.204 -9.204 -9.204 -9.204 -9.204 -9.204 -0.653 -4.627 electronvolt
mo.energy: -1.117 electronvolt
energy: -9.204 -9.204 -9.204 -9.204 -9.204 electronvolt
mo.energy: -1.006 electronvolt
energy: -9.204 -9.204 -9.204 -9.204 -9.204 -9.204 -9.204 -9.204 -9.204 -9.204 -0.653 electronvolt
mo.energy: -0.901 electronvolt
energy: -9.204 -9.204 -9.204 -9.204 -9.204 -9.204 -9.204 -9.204 -9.204 electronvolt
mo.energy: -0.888 electronvolt
energy: -9.204 -9.204 -9.204 -9.204 -9.204 -9.204 -9.204 -9.204 -9.204 -9.204 electronvolt
mo.energy: -0.879 electronvolt
energy: -9.204 -9.204 -9.204 -9.204 -9.204 -9.204 electronvolt
mo.energy: -0.840 electronvolt
energy: -9.204 -9.204 -9.204 -9.204 -9.204 -9.204 -9.204 -9.204 -9.204 -9.204 9.644 electronvolt
mo.energy: -0.823 electronvolt
mo.energy: -0.598 electronvolt
energy: -9.204 -9.204 -9.204 -9.204 -9.204 -4.627 electronvolt
mo.energy: -0.574 electronvolt
energy: -9.204 -9.204 -9.204 -9.204 -9.204 -9.204 9.644 -9.204 9.644 -0.653 -9.204 electronvolt
mo.energy: -0.305 electronvolt
energy: -9.204 -9.204 -9.204 -9.204 9.644 electronvolt
mo.energy: 2.318 electronvolt
energy: -4.627 -4.627 -9.204 -9.204 -9.204 -9.204 -4.627 3.974 -0.653 electronvolt
mo.energy: 2.656 electronvolt
energy: -4.627 -4.627 -9.204 -9.204 -9.204 -9.204 -9.204 -9.204 3.974 -4.627 electronvolt
mo.energy: 3.323 electronvolt
energy: -4.627 -4.627 -9.204 -9.204 -9.204 -9.204 -4.627 -9.204 -9.204 3.974 3.974 electronvolt
mo.energy: 3.416 electronvolt
energy: -4.627 -9.204 -4.627 3.974 -9.204 -9.204 9.644 electronvolt
mo.energy: 3.436 electronvolt
energy: -4.627 -9.204 -4.627 -4.627 -9.204 -4.627 -9.204 -4.627 -4.627 -9.204 9.644 electronvolt
mo.energy: 3.661 electronvolt
energy: -4.627 -4.627 -9.204 -9.204 -4.627 -9.204 -4.627 -4.627 -9.204 -4.627 3.974 -9.204 -0.653 3.974 electronvolt
mo.energy: 3.796 electronvolt
energy: -4.627 -9.204 -9.204 3.974 -9.204 -4.627 -9.204 -9.204 -9.204 -4.627 electronvolt
mo.energy: 3.924 electronvolt
energy: -4.627 -9.204 -4.627 -9.204 3.974 -9.204 -4.627 -9.204 9.644 -9.204 electronvolt
mo.energy: 4.014 electronvolt
energy: -4.627 -4.627 -9.204 -9.204 -9.204 -9.204 -4.627 -9.204 -9.204 3.974 -9.204 -4.627 -9.204 3.974 -9.204 -4.627 electronvolt
mo.energy: 4.370 electronvolt
energy: -4.627 -4.627 -4.627 -9.204 -9.204 -9.204 -9.204 -9.204 -0.653 -14.129 3.974 3.974 -24.141 electronvolt
mo.energy: 4.498 electronvolt
energy: -4.627 -9.204 -9.204 -9.204 3.974 -9.204 -9.204 -0.653 electronvolt
mo.energy: 4.599 electronvolt
energy: -4.627 -9.204 -4.627 -9.204 -4.627 -9.204 -4.627 3.974 -9.204 -4.627 -4.627 -9.204 -9.204 -0.653 electronvolt
mo.energy: 4.686 electronvolt
energy: -4.627 -4.627 -9.204 -4.627 -9.204 -9.204 -9.204 3.974 3.974 -9.204 -9.204 electronvolt
mo.energy: 4.805 electronvolt
energy: -4.627 -4.627 -4.627 -9.204 -9.204 -9.204 -9.204 3.974 -9.204 -9.204 -9.204 -9.204 -9.204 3.974 3.974 -9.204 -24.141 electronvolt
mo.energy: 5.068 electronvolt
energy: -4.627 -9.204 -9.204 -4.627 -9.204 -4.627 3.974 -9.204 -9.204 3.974 -14.129 -9.204 electronvolt
mo.energy: 5.701 electronvolt
energy: -4.627 -4.627 -9.204 -9.204 -0.653 -14.129 -9.204 -9.204 24.443 1.301 -24.141 3.299 -5.836 -4.627 9.644 -9.204 9.644 electronvolt
mo.energy: 5.806 electronvolt
energy: -4.627 -4.627 -4.627 -4.627 -4.627 -9.204 -9.204 -0.653 -9.204 -9.204 -24.141 -9.204 -9.204 -9.204 -9.204 -9.204 3.974 electronvolt
mo.energy: 6.369 electronvolt
energy: 1.301 -5.836 3.299 24.443 -0.653 24.443 24.443 -4.627 3.974 15.125 -24.141 -24.141 -14.129 electronvolt
mo.energy: 6.509 electronvolt
energy: -4.627 -4.627 -4.627 -9.204 -0.653 -9.204 -9.204 -9.204 -24.141 -9.204 -24.141 -9.204 -9.204 -5.836 24.443 20.489 electronvolt
mo.energy: 6.521 electronvolt
energy: -4.627 -4.627 -4.627 -9.204 -9.204 -9.204 -0.653 -9.204 -0.653 -24.141 1.301 -24.141 9.644 -9.204 -4.627 -9.204 -9.204 24.443 electronvolt
mo.energy: 6.724 electronvolt
energy: -4.627 -9.204 -9.204 -24.141 -4.627 -24.141 3.974 9.644 -9.204 -0.653 -4.627 -9.204 -0.653 24.443 24.443 -9.204 electronvolt
mo.energy: 6.926 electronvolt
energy: 1.301 -5.836 2.319 -5.576 -0.653 -0.653 24.443 3.974 15.125 electronvolt
mo.energy: 7.102 electronvolt
energy: -5.836 1.301 -4.627 -4.627 -9.204 -5.576 24.443 -4.627 -4.627 -4.627 -0.653 -9.204 -24.141 -9.204 -4.627 -4.627 3.974 -0.653 9.644 electronvolt
mo.energy: 7.223 electronvolt
energy: -4.627 -9.204 -5.836 -4.627 -9.204 -4.627 -4.627 1.301 -0.653 -9.204 -24.141 20.489 24.443 10.272 9.644 28.861 electronvolt
