program: AMS
programVersion: 2021.106
runtype: GEOMETRY OPTIMIZATION
method: DFT
functional: Becke88 Perdew86
functional: VWN
spinMolecule: Restricted
epsl: 37.50000
solvent: Acetonitrile angstrom
formula: O40SiW12
InChI: InChI=1S/O4Si.36O.12W/c1-5(2,3)4;;;;;;;;;;;;;;;;;;;;;;;;;;;;;;;;;;;;;;;;;;;;;;;;
53 atoms
Si 0.000000 0.000000 0.000000
W  2.546786 2.546786 0.116327
W  -2.546786 2.546786 -0.116327
W  -2.546786 -2.546786 0.116327
W  2.546786 -2.546786 -0.116327
W  0.116327 2.546786 2.546786
W  -0.116327 -2.546786 2.546786
W  0.116327 -2.546786 -2.546786
W  -0.116327 2.546786 -2.546786
W  -2.546786 0.116327 -2.546786
W  2.546786 -0.116327 -2.546786
W  2.546786 0.116327 2.546786
W  -2.546786 -0.116327 2.546786
O  0.953248 0.953248 0.953248
O  -0.953248 0.953248 -0.953248
O  -0.953248 -0.953248 0.953248
O  0.953248 -0.953248 -0.953248
O  1.159466 1.159466 -3.033689
O  -1.159466 1.159466 3.033689
O  -1.159466 -1.159466 -3.033689
O  1.159466 -1.159466 3.033689
O  -3.033689 1.159466 1.159466
O  3.033689 -1.159466 1.159466
O  -3.033689 -1.159466 -1.159466
O  3.033689 1.159466 -1.159466
O  -1.159466 -3.033689 -1.159466
O  1.159466 3.033689 -1.159466
O  1.159466 -3.033689 1.159466
O  -1.159466 3.033689 1.159466
O  1.525902 1.525902 3.448770
O  -1.525902 1.525902 -3.448770
O  -1.525902 -1.525902 3.448770
O  1.525902 -1.525902 -3.448770
O  3.448770 1.525902 1.525902
O  -3.448770 -1.525902 1.525902
O  3.448770 -1.525902 -1.525902
O  -3.448770 1.525902 -1.525902
O  -1.525902 3.448770 -1.525902
O  1.525902 -3.448770 -1.525902
O  1.525902 3.448770 1.525902
O  -1.525902 -3.448770 1.525902
O  3.763861 3.763861 -0.203119
O  -3.763861 3.763861 0.203119
O  -3.763861 -3.763861 -0.203119
O  3.763861 -3.763861 0.203119
O  -0.203119 3.763861 3.763861
O  0.203119 -3.763861 3.763861
O  -0.203119 -3.763861 -3.763861
O  0.203119 3.763861 -3.763861
O  -3.763861 -0.203119 -3.763861
O  3.763861 0.203119 -3.763861
O  3.763861 -0.203119 3.763861
O  -3.763861 0.203119 3.763861
elementType: Si W W W W W W W W W W W W O O O O O O O O O O O O O O O O O O O O O O O O O O O O O O O O O O O O O O O O
mdcq: 1.27623337 2.00959910 2.00959909 2.00959908 2.00959908 2.00960003 2.00960002 2.00960003 2.00960002 2.00960003 2.00960001 2.00960003 2.00960001 -0.82446327 -0.82446327 -0.82446327 -0.82446327 -0.76623796 -0.76623796 -0.76623796 -0.76623796 -0.76623814 -0.76623814 -0.76623813 -0.76623813 -0.76623814 -0.76623814 -0.76623814 -0.76623813 -0.77421745 -0.77421745 -0.77421745 -0.77421745 -0.77421600 -0.77421600 -0.77421601 -0.77421600 -0.77421600 -0.77421600 -0.77421600 -0.77421600 -0.63401035 -0.63401035 -0.63401035 -0.63401035 -0.63401009 -0.63401009 -0.63401009 -0.63401009 -0.63401009 -0.63401009 -0.63401009 -0.63401009
eener: -399.576597 electronvolt
kinener: 336.400886 electronvolt
coulombener: 7.301933 electronvolt
xcener: -385.866597 electronvolt
solvener: -18.157568 electronvolt
dispener: 0.000000 electronvolt
total: -459.897953 electronvolt
charge: 2.51138375 2.49884450 2.49884450 2.49884450 2.49884450 2.49884450 2.49884450 2.49884450 2.49884450 2.49884450 2.49884450 2.49884450 2.49884450 -1.15777507 -1.15777507 -1.15777507 -1.15777507 -0.94586896 -0.94586896 -0.94586896 -0.94586896 -0.94586896 -0.94586896 -0.94586896 -0.94586896 -0.94586896 -0.94586896 -0.94586896 -0.94586896 -0.94832478 -0.94832478 -0.94832478 -0.94832478 -0.94832478 -0.94832478 -0.94832478 -0.94832478 -0.94832478 -0.94832478 -0.94832478 -0.94832478 -0.76134104 -0.76134104 -0.76134104 -0.76134104 -0.76134104 -0.76134104 -0.76134104 -0.76134104 -0.76134104 -0.76134104 -0.76134104 -0.76134104
dipole: -0.00000000 -0.00000000 -0.00000000
dipole: 0.000000
quadrupole: 0.00000000 0.00000000 0.00000000 0.00000000 0.00000000 -0.00000000
charge: -4
converged: GEOMETRY CONVERGED
mo.energy: -25.083 electronvolt
energy: -24.141 -24.141 -24.141 -5.836 -10.970 3.796 -9.204 -0.653 -24.141 1.301 electronvolt
mo.energy: -24.252 electronvolt
energy: -24.141 -24.141 -24.141 -24.141 -24.141 -5.836 -24.141 -4.152 electronvolt
mo.energy: -24.237 electronvolt
energy: -24.141 -24.141 -24.141 -4.627 -9.204 -4.627 electronvolt
mo.energy: -23.989 electronvolt
energy: -24.141 -24.141 -24.141 -4.627 -24.141 -4.627 -24.141 electronvolt
mo.energy: -23.673 electronvolt
energy: -24.141 -24.141 -4.627 -24.141 3.974 electronvolt
mo.energy: -23.579 electronvolt
energy: -24.141 -24.141 -24.141 -24.141 -4.627 1.859 -4.627 -24.141 9.886 electronvolt
mo.energy: -23.548 electronvolt
energy: -24.141 -24.141 -4.627 3.974 -0.653 electronvolt
mo.energy: -23.308 electronvolt
energy: -24.141 -24.141 -24.141 -5.836 electronvolt
mo.energy: -23.239 electronvolt
energy: -24.141 -24.141 -24.141 -24.141 -24.141 -4.627 -24.141 -5.836 electronvolt
mo.energy: -23.085 electronvolt
energy: -24.141 -24.141 -4.627 -4.627 electronvolt
mo.energy: -22.978 electronvolt
energy: -24.141 -24.141 -4.627 -43.279 electronvolt
mo.energy: -22.946 electronvolt
energy: -24.141 -4.627 -4.627 -0.653 electronvolt
mo.energy: -22.935 electronvolt
energy: -24.141 -24.141 -4.627 -24.141 -4.627 -43.279 electronvolt
mo.energy: -22.930 electronvolt
energy: -24.141 -4.627 -24.141 -24.141 -4.627 -43.279 electronvolt
mo.energy: -22.906 electronvolt
energy: -24.141 -4.627 -24.141 -43.279 -24.141 -4.627 electronvolt
mo.energy: -22.868 electronvolt
energy: -24.141 -24.141 -24.141 -24.141 -24.141 -24.141 electronvolt
mo.energy: -22.837 electronvolt
energy: -24.141 -24.141 -24.141 -4.627 -4.152 electronvolt
mo.energy: -13.352 electronvolt
energy: -9.204 -4.627 3.796 -9.204 -10.970 -24.141 9.644 -9.204 -4.627 electronvolt
mo.energy: -12.664 electronvolt
energy: -4.627 -9.204 -9.204 3.974 -4.627 electronvolt
mo.energy: -12.593 electronvolt
energy: -9.204 -9.204 -4.627 -9.204 -9.204 -9.204 -9.204 -4.627 3.974 1.301 -5.836 -4.627 -4.627 3.974 electronvolt
mo.energy: -11.996 electronvolt
energy: -9.204 -4.627 -4.627 -9.204 -9.204 -9.204 -9.204 -4.627 -9.204 -9.204 -4.627 -4.152 1.859 -9.204 -9.204 -0.653 electronvolt
mo.energy: -11.925 electronvolt
energy: -9.204 -4.627 -4.627 -9.204 -9.204 -9.204 -9.204 -9.204 -4.627 3.974 3.974 electronvolt
mo.energy: -11.804 electronvolt
energy: -9.204 -9.204 -4.627 -4.627 -4.627 -4.627 3.974 -9.204 1.301 -9.204 -9.204 15.125 electronvolt
mo.energy: -11.690 electronvolt
energy: -9.204 -9.204 -9.204 -9.204 -4.627 -9.204 -9.204 -4.627 3.974 -9.204 1.859 1.301 -4.627 -9.204 -24.141 electronvolt
mo.energy: -11.552 electronvolt
energy: -4.627 -9.204 -9.204 -9.204 -4.627 -9.204 3.974 -4.627 3.974 electronvolt
mo.energy: -11.061 electronvolt
energy: -9.204 -4.627 -9.204 -9.204 -9.204 -9.204 -9.204 -9.204 -4.627 -9.204 3.974 -24.141 -4.627 9.886 electronvolt
mo.energy: -11.041 electronvolt
energy: -4.627 -9.204 -9.204 -9.204 -9.204 -9.204 -4.627 -9.204 -9.204 -9.204 -4.627 -4.627 -9.204 -0.653 -4.627 -9.204 -4.627 3.974 -9.204 electronvolt
mo.energy: -10.990 electronvolt
energy: -9.204 -9.204 -4.627 -9.204 -4.627 -9.204 -4.627 -9.204 -9.204 -9.204 -4.627 3.974 -0.653 3.974 electronvolt
mo.energy: -10.646 electronvolt
energy: -9.204 -4.627 -9.204 -9.204 -4.627 -4.627 -9.204 -9.204 -9.204 3.796 3.974 electronvolt
mo.energy: -10.489 electronvolt
energy: -4.627 -9.204 -4.627 -9.204 -4.627 -9.204 -9.204 -9.204 -9.204 -9.204 -9.204 -9.204 -9.204 -4.627 -4.627 -9.204 -9.204 3.974 electronvolt
mo.energy: -10.453 electronvolt
energy: -4.627 -9.204 -9.204 -9.204 -9.204 -9.204 -4.627 -9.204 -4.627 -9.204 -9.204 -9.204 -9.204 -4.627 -9.204 -4.627 electronvolt
mo.energy: -10.164 electronvolt
energy: -9.204 -9.204 -9.204 -4.627 -9.204 -9.204 -4.627 -9.204 -9.204 -4.627 -9.204 -4.627 -9.204 -9.204 -9.204 3.974 3.974 -4.627 -24.141 electronvolt
mo.energy: -10.133 electronvolt
energy: -4.627 -9.204 -9.204 -9.204 -9.204 -9.204 -9.204 -9.204 -9.204 -9.204 -4.627 -4.627 -4.627 electronvolt
mo.energy: -9.941 electronvolt
energy: -9.204 -9.204 -4.627 -4.627 -9.204 -9.204 3.974 -9.204 -0.653 -24.141 20.489 electronvolt
mo.energy: -9.909 electronvolt
energy: -9.204 -9.204 -9.204 -9.204 -9.204 -9.204 -4.627 -4.627 -9.204 -4.627 -9.204 -9.204 -9.204 -4.627 -24.141 -4.627 -4.627 -9.204 electronvolt
mo.energy: -9.904 electronvolt
energy: -9.204 -9.204 -9.204 -9.204 -4.627 -9.204 -9.204 -9.204 -9.204 -9.204 -9.204 -4.627 -9.204 -4.627 -9.204 -4.627 3.974 -4.627 electronvolt
mo.energy: -9.790 electronvolt
energy: -9.204 -9.204 -9.204 -4.627 -4.627 -4.627 -9.204 -4.627 -9.204 -9.204 -9.204 -0.653 -9.204 -9.204 -9.204 -9.204 electronvolt
mo.energy: -9.757 electronvolt
energy: -9.204 -9.204 -4.627 -9.204 -9.204 -9.204 -9.204 -4.627 -9.204 -4.627 -24.141 -4.627 -4.627 3.974 -9.204 electronvolt
mo.energy: -9.428 electronvolt
energy: -9.204 -4.627 -9.204 -9.204 -9.204 -9.204 -9.204 -9.204 -4.627 -9.204 electronvolt
mo.energy: -9.421 electronvolt
energy: -9.204 -4.627 -9.204 -9.204 -9.204 -9.204 -9.204 -4.627 -9.204 -9.204 -4.627 -24.141 electronvolt
mo.energy: -9.377 electronvolt
energy: -9.204 -4.627 -9.204 -9.204 -9.204 -9.204 -9.204 -9.204 -4.627 -4.627 -9.204 -24.141 -9.204 -9.204 -9.204 -9.204 -4.627 -9.204 electronvolt
mo.energy: -9.328 electronvolt
energy: -9.204 -4.627 -9.204 -4.627 -9.204 -24.141 -24.141 -0.653 electronvolt
mo.energy: -9.128 electronvolt
energy: -9.204 -9.204 -9.204 -4.627 -9.204 -4.627 -9.204 -9.204 -0.653 electronvolt
mo.energy: -9.025 electronvolt
energy: -9.204 -4.627 -0.653 -4.627 electronvolt
mo.energy: -9.005 electronvolt
energy: -9.204 -9.204 -4.627 -4.627 -4.627 -9.204 -9.204 -0.653 electronvolt
mo.energy: -8.977 electronvolt
energy: -9.204 -9.204 -9.204 -4.627 -9.204 -24.141 -9.204 3.974 -24.141 1.859 electronvolt
mo.energy: -8.935 electronvolt
energy: -9.204 -9.204 -9.204 -9.204 -9.204 -9.204 -9.204 -4.627 -9.204 -0.653 20.489 electronvolt
mo.energy: -8.844 electronvolt
energy: -9.204 -9.204 -0.653 20.489 -4.627 3.974 -43.279 electronvolt
mo.energy: -8.696 electronvolt
energy: -9.204 -9.204 -9.204 -9.204 -9.204 -0.653 3.974 -24.141 -9.204 electronvolt
mo.energy: -8.508 electronvolt
energy: -9.204 -9.204 -9.204 -9.204 -9.204 -4.627 -4.627 -9.204 -0.653 -9.204 -0.653 9.886 electronvolt
mo.energy: -8.465 electronvolt
energy: -9.204 -4.627 -9.204 -9.204 -9.204 -4.627 -9.204 -9.204 -9.204 electronvolt
mo.energy: -8.432 electronvolt
energy: -9.204 -9.204 -9.204 -9.204 9.886 -4.627 -9.204 -4.627 -9.204 electronvolt
mo.energy: -8.421 electronvolt
energy: -9.204 -9.204 -9.204 -9.204 -9.204 -0.653 electronvolt
mo.energy: -8.001 electronvolt
energy: -9.204 -9.204 -9.204 -9.204 -9.204 -9.204 -9.204 -9.204 -9.204 -9.204 -9.204 electronvolt
mo.energy: -7.974 electronvolt
energy: -9.204 -9.204 -9.204 -9.204 -9.204 -9.204 -9.204 -9.204 -9.204 -0.653 electronvolt
mo.energy: -7.722 electronvolt
energy: -9.204 -9.204 -9.204 -9.204 -9.204 -9.204 -9.204 -9.204 -9.204 -9.204 -9.204 -9.204 -9.204 -0.653 electronvolt
mo.energy: -7.636 electronvolt
energy: -9.204 -9.204 -9.204 -9.204 -9.204 -9.204 electronvolt
mo.energy: -7.518 electronvolt
energy: -9.204 -9.204 -9.204 -9.204 -9.204 -9.204 -9.204 -9.204 -9.204 -9.204 -9.204 -4.627 -9.204 -0.653 electronvolt
mo.energy: -7.372 electronvolt
energy: -9.204 -9.204 -9.204 -9.204 -9.204 -9.204 -9.204 -9.204 -9.204 -9.204 -9.204 -9.204 electronvolt
mo.energy: -7.341 electronvolt
energy: -9.204 -9.204 -9.204 -9.204 -9.204 -9.204 -9.204 -9.204 electronvolt
mo.energy: -7.298 electronvolt
energy: -9.204 -9.204 -9.204 -9.204 -9.204 -9.204 -9.204 -9.204 -9.204 -9.204 electronvolt
mo.energy: -7.281 electronvolt
energy: -9.204 -9.204 -9.204 -9.204 -9.204 electronvolt
mo.energy: -7.203 electronvolt
energy: -9.204 -9.204 -9.204 -9.204 -9.204 -9.204 -9.204 electronvolt
mo.energy: -7.140 electronvolt
energy: -9.204 -9.204 -9.204 -9.204 -9.204 -9.204 9.644 electronvolt
mo.energy: -7.075 electronvolt
mo.energy: -7.040 electronvolt
energy: -9.204 -9.204 -9.204 -9.204 -9.204 -9.204 -9.204 9.644 -9.204 -0.653 -9.204 -9.204 9.644 electronvolt
mo.energy: -6.801 electronvolt
energy: -9.204 -9.204 -9.204 9.644 -9.204 -9.204 electronvolt
mo.energy: -4.124 electronvolt
energy: -4.627 -4.627 -9.204 -9.204 -9.204 -9.204 -4.627 3.974 -0.653 electronvolt
mo.energy: -3.790 electronvolt
energy: -4.627 -4.627 -9.204 -9.204 -9.204 -9.204 -9.204 -9.204 3.974 -4.627 electronvolt
mo.energy: -3.105 electronvolt
energy: -4.627 -4.627 -9.204 -9.204 -9.204 -9.204 -4.627 -9.204 -9.204 3.974 3.974 electronvolt
mo.energy: -3.096 electronvolt
energy: -4.627 -9.204 -4.627 3.974 -9.204 9.644 -9.204 electronvolt
mo.energy: -3.081 electronvolt
energy: -9.204 -4.627 -4.627 -4.627 -9.204 -4.627 -4.627 -4.627 9.644 -9.204 electronvolt
mo.energy: -2.814 electronvolt
energy: -4.627 -4.627 -9.204 -9.204 -4.627 -4.627 -9.204 -4.627 3.974 -9.204 -9.204 -9.204 3.974 electronvolt
mo.energy: -2.716 electronvolt
energy: -4.627 -9.204 -9.204 -9.204 3.974 -4.627 -4.627 -9.204 -9.204 -9.204 electronvolt
mo.energy: -2.634 electronvolt
energy: -4.627 -9.204 -4.627 -9.204 3.974 -4.627 -9.204 -9.204 -4.627 9.644 electronvolt
mo.energy: -2.465 electronvolt
energy: -4.627 -4.627 -9.204 -9.204 -9.204 -9.204 3.974 -9.204 -9.204 3.974 -9.204 -4.627 -9.204 electronvolt
mo.energy: -2.102 electronvolt
energy: -4.627 -4.627 -4.627 -9.204 -9.204 -9.204 -9.204 -9.204 3.974 -10.970 -0.653 3.974 3.974 -24.141 electronvolt
mo.energy: -2.011 electronvolt
energy: -4.627 -9.204 -9.204 3.974 -9.204 -9.204 -9.204 -4.627 electronvolt
mo.energy: -1.911 electronvolt
energy: -4.627 -4.627 -9.204 -9.204 -4.627 -4.627 -9.204 -9.204 3.974 -9.204 -4.627 -9.204 -4.627 electronvolt
mo.energy: -1.868 electronvolt
energy: -4.627 -9.204 -4.627 -4.627 -9.204 -9.204 -9.204 3.974 -9.204 3.974 -4.627 electronvolt
mo.energy: -1.738 electronvolt
energy: -4.627 -4.627 -4.627 -9.204 -9.204 -9.204 -9.204 3.974 -9.204 -9.204 -9.204 -9.204 -9.204 3.974 -9.204 -4.627 electronvolt
mo.energy: -1.440 electronvolt
energy: -4.627 -9.204 -9.204 -4.627 -4.627 -9.204 3.974 -9.204 3.974 electronvolt
mo.energy: -0.559 electronvolt
energy: -4.627 -4.627 -9.204 -0.653 -9.204 -10.970 24.443 -9.204 -24.141 -9.204 1.301 3.796 9.644 -9.204 9.644 -24.141 electronvolt
mo.energy: -0.487 electronvolt
energy: -4.627 -4.627 -4.627 -4.627 -9.204 -9.204 -0.653 -9.204 -4.627 -24.141 -9.204 -9.204 3.974 -24.141 -9.204 -9.204 -5.836 24.443 -24.141 electronvolt
mo.energy: 0.052 electronvolt
energy: 1.301 -5.836 24.443 24.443 24.443 3.796 -24.141 -24.141 -0.653 -10.970 3.974 24.443 electronvolt
mo.energy: 0.272 electronvolt
energy: -4.627 -4.627 -4.627 -9.204 -9.204 -0.653 -9.204 -24.141 -24.141 -9.204 -5.836 -9.204 -9.204 -9.204 24.443 -4.627 -9.204 24.443 -9.204 electronvolt
mo.energy: 0.327 electronvolt
energy: -4.627 -4.627 -4.627 -9.204 -9.204 -0.653 -9.204 -9.204 -0.653 -24.141 -24.141 9.644 -9.204 -9.204 24.443 9.644 24.443 electronvolt
mo.energy: 0.433 electronvolt
energy: -4.627 -9.204 -9.204 -24.141 -24.141 -9.204 3.974 9.644 -4.627 -0.653 24.443 24.443 -9.204 electronvolt
mo.energy: 0.681 electronvolt
energy: 1.301 -5.836 1.859 -4.152 -0.653 24.443 -0.653 3.974 15.125 18.672 24.443 electronvolt
mo.energy: 0.999 electronvolt
energy: -5.836 1.301 -4.627 -9.204 -4.627 -4.152 24.443 -4.627 -4.627 -24.141 -0.653 -9.204 -4.627 -0.653 1.301 -9.204 9.644 -4.627 3.974 1.859 electronvolt
mo.energy: 1.160 electronvolt
energy: -4.627 -9.204 -4.627 -4.627 -5.836 -9.204 -9.204 -0.653 -9.204 1.301 -24.141 20.489 9.644 24.443 9.886 28.861 electronvolt
