program: AMS
programVersion: 2021.106
runtype: GEOMETRY OPTIMIZATION
method: DFT
functional: PBEc PBEx
spinMolecule: Restricted
epsl: 78.39000
solvent: Water angstrom
functional: PW92 == Not Default ==
formula: O34PW9
InChI: InChI=1S/O4P.30O.9W/c1-5(2,3)4;;;;;;;;;;;;;;;;;;;;;;;;;;;;;;;;;;;;;;;
44 atoms
W  -4.169561 -4.971365 9.710324
W  -0.127786 -1.943192 10.914717
W  -2.131216 0.938009 10.837422
W  -6.347707 -1.841007 9.623157
W  -2.668187 -1.635783 8.512494
O  -2.528712 -1.473000 10.949300
O  -2.288149 0.271833 8.961514
O  -4.506977 -1.275486 8.765046
O  -0.760130 -1.925107 9.021071
O  -2.490179 -1.559473 6.735896
O  -5.550513 -3.614545 9.476988
O  -6.458200 0.043853 10.176008
O  -4.016020 1.078119 10.889727
O  -0.350185 0.037959 10.794081
O  -7.634691 -2.413469 10.747890
O  -0.653517 -3.755447 11.019900
O  -7.234088 -1.726445 8.076507
O  -1.618571 2.618287 10.509064
O  -4.332187 -5.899875 8.192825
O  -2.976329 -3.475301 8.823271
W  -5.818221 0.699317 11.916848
W  -1.663068 -5.275256 12.080553
O  1.633436 -2.057371 10.633713
O  -2.698062 1.948654 15.274557
P  -3.556418 -2.161415 11.948017
O  -3.138533 -1.831565 13.422601
O  -4.995945 -1.608225 11.667585
O  -3.530117 -3.712599 11.723438
O  -2.456222 -5.710188 10.334024
O  -5.182352 -5.936059 10.847189
O  0.511642 -2.659293 15.398580
O  -0.242911 -1.788823 12.795295
O  -1.196410 -4.139050 13.594670
O  -0.266890 -6.388553 12.034085
O  -4.631783 0.793811 13.461815
O  -7.147422 -0.058714 12.869623
O  -2.077069 0.844764 12.724770
O  -4.034225 -0.436550 15.815216
O  -6.372756 2.393017 11.795720
O  -2.860395 -6.221094 13.039924
O  -1.383928 -0.567743 14.975873
W  -3.057679 0.365381 14.529786
W  -1.078469 -2.475493 14.605841
O  -2.201917 -3.068089 15.884721
elementType: W W W W W O O O O O O O O O O O O O O O W W O O P O O O O O O O O O O O O O O O O W W O
mdcq: 2.03016022 1.99244020 1.99327909 2.03229878 1.99133285 -0.75132105 -0.90232806 -0.83514266 -0.90272563 -0.82926596 -0.83730296 -0.84867631 -0.83481584 -0.90210777 -0.85621224 -0.83309712 -0.83946819 -0.82895706 -0.83956007 -0.83277986 2.02965099 2.02980469 -0.82974714 -0.83742771 1.61335389 -0.86371102 -0.86054857 -0.87250878 -0.84657741 -0.85545821 -0.84012081 -0.83469215 -0.83546662 -0.83840732 -0.83557745 -0.85737081 -0.83601933 -0.85711460 -0.83889431 -0.85608230 -0.84883543 2.02889876 2.03306268 -0.85596139
eener: -304.772099 electronvolt
kinener: 298.453625 electronvolt
coulombener: 71.088370 electronvolt
xcener: -359.901011 electronvolt
solvener: -102.622893 electronvolt
dispener: 0.000000 electronvolt
total: -397.754001 electronvolt
charge: 2.32314899 2.38809527 2.38800953 2.32297621 2.38876249 -1.02193225 -1.01794228 -0.96711157 -1.01778930 -0.89592730 -0.99438653 -1.01760328 -0.96715020 -1.01797606 -0.88981710 -0.96653422 -0.88461089 -0.89591283 -0.88479751 -0.96711824 2.32304912 2.32367949 -0.89586833 -0.88460439 2.02271846 -0.95997186 -0.95944484 -0.96033129 -1.01757761 -0.88970130 -0.88451117 -0.96711575 -0.99462380 -0.88468223 -0.99437991 -0.88989312 -0.96707035 -0.88987318 -0.88459241 -0.88948742 -1.01770503 2.32381063 2.32363784 -0.88984448
quadrupole: 1907.89206696 -260.21934835 1743.55553011 2194.03069615 1043.86741905 -4101.92276311
charge: -9
converged: GEOMETRY CONVERGED
charge: 2.3231 2.3881 2.3880 2.3230 2.3888 -1.0219 -1.0179 -0.9671 -1.0178 -0.8959 -0.9944 -1.0176 -0.9672 -1.0180 -0.8898 -0.9665 -0.8846 -0.8959 -0.8848 -0.9671 2.3230 2.3237 -0.8959 -0.8846 2.0227 -0.9600 -0.9594 -0.9603 -1.0176 -0.8897 -0.8845 -0.9671 -0.9946 -0.8847 -0.9944 -0.8899 -0.9671 -0.8899 -0.8846 -0.8895 -1.0177 2.3238 2.3236 -0.8898
mo.energy: -23.120 electronvolt
energy: -24.020 -24.020 -24.020 -24.020 -5.485 -5.485 -5.485 -24.020 -24.020 -24.020 10.371 electronvolt
mo.energy: -22.912 electronvolt
energy: -24.020 -24.020 -24.020 -5.485 -24.020 -24.020 10.371 -24.020 electronvolt
mo.energy: -22.908 electronvolt
energy: -24.020 -24.020 -5.485 -5.485 -24.020 -24.020 -24.020 10.371 -24.020 -24.020 electronvolt
mo.energy: -22.692 electronvolt
energy: -24.020 -24.020 -24.020 -24.020 -24.020 -24.020 -24.020 -24.020 -24.020 -24.020 -24.020 -24.020 -24.020 -24.020 -24.020 electronvolt
mo.energy: -22.384 electronvolt
energy: -24.020 -24.020 -24.020 -24.020 -24.020 -24.020 -24.020 -24.020 -24.020 -24.020 -24.020 electronvolt
energy: -24.020 -24.020 -24.020 -24.020 -24.020 -24.020 -24.020 -24.020 -24.020 -24.020 electronvolt
mo.energy: -22.196 electronvolt
energy: -24.020 -24.020 -24.020 -24.020 -24.020 -24.020 -24.020 -24.020 -24.020 -24.020 -24.020 -24.020 -24.020 -24.020 -24.020 -24.020 electronvolt
mo.energy: -22.006 electronvolt
energy: -24.020 -24.020 -24.020 -24.020 -24.020 -24.020 -24.020 -24.020 -24.020 -24.020 -24.020 -24.020 -24.020 -24.020 -4.492 -4.492 -24.020 electronvolt
mo.energy: -22.005 electronvolt
energy: -24.020 -24.020 -24.020 -24.020 -24.020 -24.020 -24.020 -24.020 -24.020 -24.020 -24.020 -4.492 -24.020 -24.020 -24.020 -24.020 -24.020 electronvolt
mo.energy: -21.790 electronvolt
energy: -24.020 -24.020 -24.020 -24.020 -24.020 -24.020 -24.020 -24.020 -24.020 -24.020 -24.020 -24.020 -24.020 electronvolt
mo.energy: -21.789 electronvolt
mo.energy: -21.683 electronvolt
energy: -24.020 -24.020 -24.020 -24.020 -24.020 -24.020 -24.020 -24.020 -24.020 -24.020 -24.020 -24.020 -24.020 -24.020 -4.492 -24.020 -24.020 electronvolt
mo.energy: -21.682 electronvolt
energy: -24.020 -24.020 -24.020 -24.020 -24.020 -24.020 -24.020 -24.020 -24.020 -24.020 -24.020 -24.020 -4.492 -24.020 -24.020 -24.020 -24.020 -24.020 -4.492 electronvolt
mo.energy: -21.672 electronvolt
energy: -24.020 -24.020 -24.020 -24.020 -24.020 -24.020 -24.020 -24.020 -24.020 -24.020 -24.020 -24.020 -24.020 -24.020 -24.020 -24.020 -24.020 -24.020 electronvolt
mo.energy: -21.549 electronvolt
energy: -24.020 -24.020 -24.020 -24.020 -24.020 -24.020 -24.020 -24.020 electronvolt
mo.energy: -21.547 electronvolt
mo.energy: -21.546 electronvolt
mo.energy: -21.515 electronvolt
energy: -24.020 -24.020 -24.020 -24.020 -24.020 -24.020 electronvolt
mo.energy: -21.514 electronvolt
energy: -24.020 -24.020 -24.020 -24.020 -24.020 -24.020 -24.020 -24.020 -24.020 electronvolt
mo.energy: -21.484 electronvolt
energy: -24.020 -24.020 -24.020 -24.020 -24.020 -24.020 -24.020 -24.020 -24.020 -24.020 -24.020 -24.020 -24.020 -24.020 -24.020 -24.020 -24.020 electronvolt
mo.energy: -21.472 electronvolt
energy: -24.020 -24.020 -24.020 -24.020 -24.020 -24.020 -4.492 -4.492 -24.020 -24.020 -24.020 -24.020 -24.020 -24.020 electronvolt
energy: -24.020 -24.020 -24.020 -24.020 -24.020 -24.020 -24.020 -24.020 -24.020 -24.020 -4.492 -24.020 -4.492 electronvolt
mo.energy: -21.469 electronvolt
energy: -24.020 -24.020 -24.020 -4.492 -4.492 -4.492 electronvolt
mo.energy: -21.335 electronvolt
energy: -24.020 -24.020 -24.020 -24.020 -24.020 -24.020 -24.020 -24.020 -24.020 -24.020 -24.020 -24.020 -24.020 -24.020 -24.020 -24.020 -24.020 -24.020 -24.020 -24.020 -24.020 electronvolt
mo.energy: -21.240 electronvolt
mo.energy: -21.239 electronvolt
mo.energy: -20.958 electronvolt
mo.energy: -20.957 electronvolt
mo.energy: -20.880 electronvolt
mo.energy: -20.868 electronvolt
energy: -24.020 -24.020 -24.020 -24.020 -24.020 -24.020 -24.020 -24.020 -24.020 -24.020 -24.020 -24.020 electronvolt
mo.energy: -20.805 electronvolt
mo.energy: -13.128 electronvolt
energy: -14.028 -9.089 -9.089 -9.089 3.429 -9.089 -9.089 -24.020 -24.020 -24.020 -24.020 -9.089 -9.089 -9.089 electronvolt
mo.energy: -11.178 electronvolt
energy: -9.089 -9.089 -9.089 -9.089 -9.089 -9.089 -9.089 -9.089 -9.089 -9.089 -9.089 -9.089 -4.492 -4.492 -4.492 -4.492 -4.492 -4.492 -4.492 -4.492 -4.492 -4.492 -4.492 -4.492 electronvolt
mo.energy: -11.073 electronvolt
energy: -9.089 -9.089 -9.089 -9.089 -5.485 -5.485 -9.089 -9.089 -9.089 -9.089 -9.089 -5.485 -9.089 -9.089 -24.020 -9.089 -4.492 2.224 2.224 -9.089 -4.492 -4.492 electronvolt
mo.energy: -10.733 electronvolt
energy: -9.089 -9.089 -5.485 -9.089 -9.089 -9.089 -9.089 2.224 -24.020 -5.485 -4.492 -9.089 -4.492 -9.089 -4.492 -24.020 -9.089 electronvolt
mo.energy: -10.730 electronvolt
energy: -9.089 -9.089 -9.089 -5.485 -9.089 -5.485 -9.089 -9.089 -9.089 -24.020 -9.089 2.224 -4.492 -4.492 -24.020 2.224 -4.492 -9.089 electronvolt
mo.energy: -10.477 electronvolt
energy: -9.089 -9.089 -9.089 -9.089 -9.089 -9.089 -9.089 -4.492 -4.492 -9.089 -4.492 -4.492 -4.492 -4.492 -9.089 -9.089 -9.089 -9.089 electronvolt
mo.energy: -10.476 electronvolt
energy: -9.089 -9.089 -9.089 -9.089 -9.089 -9.089 -4.492 -9.089 -4.492 -4.492 -9.089 -4.492 -9.089 -4.492 -4.492 -9.089 -9.089 -9.089 -4.492 -9.089 electronvolt
mo.energy: -10.316 electronvolt
energy: -4.492 -9.089 -4.492 -9.089 -4.492 -9.089 -9.089 -9.089 -9.089 -9.089 -9.089 -9.089 -9.089 -9.089 -9.089 -4.492 -4.492 4.055 4.055 -4.492 electronvolt
mo.energy: -10.298 electronvolt
energy: -9.089 -9.089 -9.089 -9.089 -9.089 -9.089 -4.492 -9.089 -4.492 -4.492 -9.089 -9.089 -9.089 -9.089 -9.089 -9.089 -4.492 -9.089 -4.492 -9.089 -9.089 -9.089 4.055 electronvolt
mo.energy: -10.296 electronvolt
energy: -9.089 -9.089 -9.089 -9.089 -9.089 -9.089 -9.089 -9.089 -4.492 -4.492 -4.492 -9.089 -9.089 -9.089 -9.089 -9.089 -9.089 -9.089 -9.089 -9.089 -4.492 -4.492 -9.089 -4.492 -4.492 electronvolt
mo.energy: -9.786 electronvolt
energy: -4.492 -4.492 -9.089 -4.492 -9.089 -9.089 -9.089 -9.089 -9.089 -9.089 -9.089 -9.089 -9.089 -9.089 -9.089 -9.089 -9.089 -9.089 -9.089 -9.089 -9.089 -9.089 -4.492 -4.492 -4.492 -4.492 electronvolt
mo.energy: -9.630 electronvolt
energy: -9.089 -9.089 -9.089 -9.089 -9.089 -4.492 -9.089 -4.492 -4.492 -4.492 -9.089 -4.492 -4.492 -4.492 -4.492 -9.089 -9.089 -9.089 electronvolt
energy: -9.089 -9.089 -9.089 -9.089 -9.089 -9.089 -4.492 -4.492 -4.492 -9.089 -9.089 -4.492 -9.089 -9.089 -9.089 -9.089 -9.089 -9.089 -4.492 -4.492 -9.089 -4.492 -9.089 electronvolt
mo.energy: -9.544 electronvolt
energy: -9.089 -9.089 -9.089 -9.089 -9.089 -9.089 -9.089 -9.089 -4.492 -4.492 -4.492 -4.492 -9.089 -4.492 -4.492 -4.492 -9.089 -9.089 -9.089 -9.089 -4.492 -4.492 -9.089 -4.492 -9.089 -9.089 -9.089 -9.089 -4.492 -4.492 -4.492 -9.089 -9.089 -9.089 electronvolt
mo.energy: -9.486 electronvolt
energy: -9.089 -9.089 -9.089 -9.089 -9.089 -9.089 -9.089 -9.089 -4.492 -4.492 -9.089 -4.492 -9.089 -9.089 -9.089 -9.089 -9.089 -9.089 -4.492 -9.089 -9.089 -4.492 -9.089 -9.089 -4.492 electronvolt
mo.energy: -9.485 electronvolt
energy: -9.089 -9.089 -9.089 -9.089 -9.089 -9.089 -9.089 -4.492 -9.089 -9.089 -9.089 -4.492 -4.492 -9.089 -4.492 -9.089 -9.089 -9.089 -9.089 -4.492 -4.492 -9.089 -9.089 -9.089 -9.089 -9.089 -4.492 -9.089 -9.089 -4.492 -9.089 electronvolt
mo.energy: -9.323 electronvolt
energy: -9.089 -9.089 -4.492 -9.089 -9.089 -9.089 -4.492 -9.089 -9.089 -4.492 -9.089 -9.089 -4.492 -9.089 -9.089 -9.089 -9.089 -4.492 -9.089 -4.492 -9.089 -4.492 -9.089 -4.492 -9.089 -9.089 -4.492 -4.492 -9.089 electronvolt
energy: -9.089 -9.089 -4.492 -9.089 -9.089 -9.089 -9.089 -9.089 -9.089 -9.089 -9.089 -4.492 -9.089 -4.492 -9.089 -9.089 -4.492 -4.492 -4.492 -9.089 -9.089 -9.089 -4.492 -4.492 -4.492 -4.492 -4.492 -9.089 -9.089 electronvolt
mo.energy: -9.245 electronvolt
energy: -9.089 -9.089 -9.089 -4.492 -4.492 -4.492 -9.089 -4.492 -9.089 -9.089 -9.089 -4.492 -4.492 -9.089 -9.089 -9.089 -9.089 -9.089 -9.089 -9.089 -9.089 -4.492 -9.089 -9.089 -9.089 -4.492 -9.089 -4.492 -4.492 -4.492 -4.492 -9.089 -9.089 electronvolt
mo.energy: -9.141 electronvolt
energy: -9.089 -4.492 -4.492 -4.492 -9.089 -9.089 -9.089 -9.089 -9.089 -9.089 -9.089 -9.089 -9.089 -9.089 -9.089 -4.492 -4.492 -9.089 -9.089 -9.089 -9.089 -4.492 -4.492 -9.089 -9.089 -9.089 -9.089 -9.089 -9.089 -4.492 -9.089 -4.492 -9.089 -9.089 electronvolt
energy: -9.089 -9.089 -4.492 -4.492 -4.492 -4.492 -9.089 -9.089 -4.492 -9.089 -9.089 -9.089 -9.089 -9.089 -4.492 -9.089 -4.492 -9.089 -9.089 -9.089 -9.089 -9.089 -9.089 -9.089 -9.089 -9.089 -9.089 -9.089 -4.492 -9.089 electronvolt
mo.energy: -8.992 electronvolt
energy: -9.089 -9.089 -9.089 -9.089 -9.089 -9.089 -9.089 -4.492 -9.089 -9.089 -4.492 -4.492 -9.089 -4.492 -9.089 -9.089 -9.089 -9.089 -4.492 -4.492 -4.492 -4.492 -9.089 -9.089 -9.089 -4.492 -9.089 -4.492 -4.492 -4.492 -9.089 -9.089 -9.089 -9.089 -9.089 -9.089 -9.089 -4.492 -9.089 -4.492 -4.492 electronvolt
mo.energy: -8.795 electronvolt
energy: -9.089 -9.089 -9.089 -9.089 -9.089 -9.089 -9.089 -4.492 -9.089 -4.492 -9.089 -4.492 -9.089 -9.089 -9.089 -9.089 -4.492 -9.089 -9.089 -9.089 -4.492 -9.089 -9.089 -4.492 -4.492 -4.492 electronvolt
mo.energy: -8.794 electronvolt
energy: -9.089 -9.089 -9.089 -9.089 -9.089 -9.089 -9.089 -4.492 -4.492 -4.492 -9.089 -4.492 -9.089 -4.492 -9.089 -9.089 -4.492 -9.089 -9.089 -9.089 -4.492 -9.089 -9.089 -9.089 -9.089 -9.089 -4.492 -4.492 electronvolt
mo.energy: -8.741 electronvolt
energy: -9.089 -9.089 -9.089 -9.089 -4.492 -4.492 -9.089 -9.089 -4.492 -4.492 -4.492 -4.492 -9.089 -9.089 -9.089 -4.492 -9.089 -9.089 -9.089 -9.089 -4.492 -4.492 -9.089 -4.492 -9.089 -9.089 -9.089 -9.089 -9.089 electronvolt
mo.energy: -8.740 electronvolt
energy: -9.089 -4.492 -9.089 -9.089 -9.089 -9.089 -9.089 -4.492 -9.089 -9.089 -4.492 -9.089 -9.089 -4.492 -9.089 -9.089 -4.492 -9.089 -9.089 -4.492 -4.492 -4.492 -4.492 -9.089 -4.492 -9.089 -9.089 -4.492 -9.089 electronvolt
mo.energy: -8.718 electronvolt
energy: -9.089 -9.089 -9.089 -4.492 -9.089 -9.089 -4.492 -9.089 -9.089 -9.089 -4.492 -9.089 -4.492 -9.089 -9.089 -4.492 -4.492 -9.089 -9.089 -4.492 -9.089 -9.089 -4.492 -4.492 -9.089 -4.492 -9.089 -9.089 -9.089 -9.089 -9.089 -9.089 electronvolt
mo.energy: -8.717 electronvolt
energy: -9.089 -9.089 -9.089 -9.089 -9.089 -4.492 -9.089 -4.492 -4.492 -9.089 -9.089 -4.492 -4.492 -9.089 -9.089 -9.089 -9.089 -4.492 -4.492 -4.492 -4.492 -9.089 -9.089 -9.089 -4.492 -9.089 -9.089 -4.492 -9.089 -9.089 -9.089 -4.492 -4.492 -9.089 -9.089 -9.089 -9.089 -9.089 -9.089 electronvolt
mo.energy: -8.695 electronvolt
energy: -9.089 -9.089 -9.089 -9.089 -9.089 -4.492 -4.492 -9.089 -9.089 -4.492 -4.492 -9.089 -9.089 -9.089 -9.089 -4.492 -4.492 -4.492 -9.089 -4.492 -9.089 -9.089 -4.492 -4.492 -4.492 -4.492 -9.089 -4.492 -4.492 -9.089 -9.089 electronvolt
mo.energy: -8.597 electronvolt
energy: -9.089 -9.089 -9.089 -9.089 -9.089 -9.089 -9.089 -4.492 -4.492 -9.089 -9.089 -4.492 -9.089 -4.492 -9.089 -9.089 -9.089 -4.492 -9.089 -4.492 -9.089 -9.089 -9.089 electronvolt
mo.energy: -8.568 electronvolt
energy: -9.089 -9.089 -9.089 -9.089 -9.089 -4.492 -9.089 -4.492 -4.492 -4.492 -9.089 -9.089 -9.089 -4.492 -9.089 -9.089 -9.089 -9.089 -9.089 -9.089 -9.089 -4.492 -4.492 -9.089 -4.492 -9.089 -9.089 -9.089 -4.492 -9.089 -9.089 -9.089 electronvolt
mo.energy: -8.567 electronvolt
energy: -9.089 -9.089 -9.089 -4.492 -4.492 -9.089 -9.089 -9.089 -4.492 -9.089 -9.089 -4.492 -9.089 -9.089 -9.089 -9.089 -9.089 -9.089 -9.089 -9.089 -9.089 -4.492 -9.089 -9.089 -9.089 -4.492 -9.089 -9.089 -9.089 -9.089 -9.089 -9.089 -4.492 electronvolt
mo.energy: -8.504 electronvolt
energy: -9.089 -9.089 -9.089 -9.089 -4.492 -9.089 -9.089 -9.089 -9.089 -9.089 -9.089 -4.492 -9.089 -4.492 -9.089 -9.089 -9.089 -4.492 -9.089 -9.089 -4.492 -9.089 -9.089 -9.089 -4.492 -4.492 -4.492 -9.089 -4.492 -9.089 -4.492 -4.492 -9.089 -4.492 -4.492 -9.089 -4.492 -4.492 -4.492 electronvolt
mo.energy: -8.472 electronvolt
energy: -9.089 -9.089 -4.492 -9.089 -9.089 -9.089 -4.492 -4.492 -4.492 -4.492 -9.089 -9.089 -9.089 -9.089 -9.089 -9.089 -9.089 -9.089 -4.492 -9.089 -9.089 -9.089 -9.089 -4.492 -9.089 -9.089 -4.492 -9.089 -4.492 -4.492 electronvolt
mo.energy: -8.305 electronvolt
energy: -9.089 -9.089 -9.089 -9.089 -9.089 -9.089 -9.089 -9.089 -9.089 -9.089 -9.089 -4.492 -9.089 -9.089 -4.492 -4.492 -4.492 -4.492 -9.089 -9.089 -9.089 -9.089 -9.089 electronvolt
mo.energy: -8.303 electronvolt
energy: -9.089 -9.089 -9.089 -9.089 -9.089 -9.089 -9.089 -9.089 -9.089 -9.089 -9.089 -9.089 -4.492 -4.492 -9.089 -9.089 -9.089 -9.089 -4.492 -9.089 -9.089 -9.089 -9.089 -9.089 electronvolt
mo.energy: -8.214 electronvolt
energy: -9.089 -9.089 -9.089 -4.492 -9.089 -9.089 -9.089 -4.492 -9.089 -4.492 -4.492 -9.089 -9.089 -4.492 -9.089 -4.492 -9.089 -9.089 -9.089 -9.089 -9.089 -9.089 -9.089 -9.089 -9.089 -4.492 -9.089 -4.492 -9.089 -9.089 -4.492 -9.089 electronvolt
energy: -9.089 -9.089 -4.492 -9.089 -9.089 -9.089 -4.492 -9.089 -4.492 -9.089 -9.089 -4.492 -4.492 -9.089 -9.089 -9.089 -4.492 -9.089 -9.089 -9.089 -9.089 -9.089 -4.492 -4.492 -9.089 -9.089 -9.089 -9.089 -4.492 -9.089 -9.089 -9.089 -9.089 electronvolt
mo.energy: -8.211 electronvolt
energy: -9.089 -9.089 -9.089 -9.089 -9.089 -9.089 -9.089 -9.089 -9.089 -9.089 -9.089 -9.089 -9.089 -4.492 -9.089 -4.492 -4.492 -9.089 -4.492 -9.089 electronvolt
mo.energy: -8.158 electronvolt
energy: -9.089 -9.089 -9.089 -9.089 -9.089 -9.089 -9.089 -9.089 -9.089 -9.089 -9.089 -9.089 -9.089 -9.089 -9.089 -9.089 -9.089 -9.089 -9.089 -9.089 -9.089 -9.089 -9.089 -9.089 -9.089 -9.089 -9.089 -9.089 -9.089 -9.089 -9.089 -9.089 electronvolt
mo.energy: -8.063 electronvolt
energy: -9.089 -9.089 -9.089 -9.089 -9.089 -9.089 -9.089 -9.089 -9.089 -4.492 -9.089 -9.089 -9.089 -9.089 -9.089 -4.492 -9.089 -4.492 -4.492 -9.089 -9.089 -4.492 electronvolt
mo.energy: -8.062 electronvolt
energy: -9.089 -9.089 -9.089 -9.089 -9.089 -9.089 -9.089 -9.089 -9.089 -9.089 -4.492 -9.089 -9.089 -4.492 -9.089 -9.089 -9.089 -9.089 -9.089 -9.089 -4.492 -9.089 -9.089 -9.089 -4.492 -9.089 electronvolt
mo.energy: -8.015 electronvolt
energy: -9.089 -9.089 -9.089 -9.089 -9.089 -9.089 -9.089 -4.492 -9.089 -4.492 -9.089 -9.089 -9.089 -9.089 -9.089 -9.089 -4.492 -4.492 -9.089 -9.089 -9.089 -9.089 -9.089 -9.089 -4.492 -9.089 -9.089 -9.089 -9.089 electronvolt
mo.energy: -8.014 electronvolt
energy: -9.089 -9.089 -9.089 -9.089 -4.492 -9.089 -9.089 -9.089 -9.089 -9.089 -9.089 -9.089 -9.089 -9.089 -4.492 -9.089 -4.492 -4.492 -9.089 -9.089 -4.492 -9.089 -9.089 -9.089 -9.089 electronvolt
mo.energy: -7.954 electronvolt
energy: -9.089 -9.089 -9.089 -9.089 -9.089 -4.492 -4.492 -9.089 -9.089 -9.089 -9.089 -9.089 -9.089 -9.089 -4.492 -9.089 -4.492 -9.089 -9.089 -9.089 -9.089 -4.492 -4.492 -4.492 -9.089 -9.089 -9.089 -9.089 electronvolt
mo.energy: -7.953 electronvolt
energy: -9.089 -9.089 -9.089 -9.089 -4.492 -9.089 -9.089 -9.089 -9.089 -9.089 -4.492 -9.089 -9.089 -4.492 -4.492 -9.089 -9.089 -4.492 -9.089 -9.089 -9.089 -9.089 -9.089 -9.089 -9.089 -9.089 -9.089 electronvolt
mo.energy: -7.886 electronvolt
energy: -9.089 -9.089 -9.089 -9.089 -9.089 -9.089 -9.089 -9.089 -9.089 -9.089 -9.089 -4.492 -9.089 electronvolt
mo.energy: -7.815 electronvolt
energy: -9.089 -9.089 -9.089 -9.089 -9.089 -4.492 -9.089 -9.089 -9.089 -9.089 -4.492 -9.089 -9.089 -9.089 -4.492 -4.492 -9.089 -4.492 -9.089 -9.089 -9.089 -4.492 -9.089 -9.089 -9.089 -9.089 -9.089 -9.089 -9.089 electronvolt
mo.energy: -7.792 electronvolt
energy: -9.089 -9.089 -4.492 -4.492 -9.089 -4.492 -9.089 -9.089 -9.089 -9.089 -9.089 -9.089 -9.089 -9.089 -9.089 -4.492 -9.089 -9.089 -9.089 -9.089 -9.089 -9.089 -9.089 electronvolt
energy: -9.089 -9.089 -9.089 -4.492 -4.492 -4.492 -9.089 -9.089 -9.089 -9.089 -9.089 -9.089 -9.089 -4.492 -9.089 -9.089 -9.089 -9.089 -9.089 -9.089 -9.089 -4.492 -4.492 -9.089 -9.089 -9.089 -9.089 electronvolt
mo.energy: -7.734 electronvolt
energy: -9.089 -9.089 -9.089 -9.089 -9.089 -9.089 -9.089 -9.089 -9.089 -9.089 -9.089 -9.089 -9.089 -9.089 -9.089 -9.089 -9.089 -9.089 -9.089 -9.089 -9.089 -9.089 -9.089 -9.089 -9.089 -9.089 -9.089 -9.089 -9.089 -9.089 -4.492 -9.089 -9.089 -9.089 -9.089 -9.089 -4.492 -4.492 electronvolt
mo.energy: -7.510 electronvolt
energy: -9.089 -9.089 -9.089 -9.089 -9.089 -9.089 -9.089 -9.089 -9.089 -9.089 -9.089 -9.089 -9.089 -9.089 -4.492 -9.089 -9.089 -4.492 -4.492 -9.089 -9.089 -9.089 -9.089 -4.492 -4.492 -4.492 -9.089 -4.492 -4.492 -9.089 -4.492 -9.089 -4.492 electronvolt
mo.energy: -7.472 electronvolt
energy: -4.492 -9.089 -9.089 -9.089 -9.089 -9.089 -4.492 -9.089 -9.089 -9.089 -9.089 -9.089 -9.089 -9.089 -9.089 -9.089 -9.089 -9.089 -9.089 -9.089 -9.089 -9.089 -9.089 -9.089 -9.089 -9.089 -9.089 -9.089 -9.089 electronvolt
mo.energy: -7.471 electronvolt
energy: -4.492 -9.089 -9.089 -4.492 -9.089 -9.089 -9.089 -9.089 -9.089 -9.089 -9.089 -9.089 -9.089 -9.089 -9.089 -9.089 -9.089 -9.089 -9.089 -9.089 -9.089 -9.089 -9.089 -4.492 -9.089 -9.089 electronvolt
mo.energy: -7.341 electronvolt
energy: -9.089 -9.089 -9.089 -9.089 -9.089 -9.089 -9.089 -9.089 -9.089 -9.089 -9.089 -9.089 -9.089 -9.089 -9.089 -9.089 -9.089 -9.089 -9.089 10.371 -9.089 10.371 electronvolt
energy: -9.089 -9.089 -9.089 -9.089 -9.089 -9.089 -9.089 -9.089 -9.089 -9.089 -9.089 -9.089 -9.089 -9.089 -9.089 -9.089 -9.089 -9.089 electronvolt
mo.energy: -7.321 electronvolt
energy: -9.089 -9.089 -9.089 -9.089 -9.089 -9.089 -9.089 -9.089 -9.089 -9.089 -9.089 -9.089 -9.089 -4.492 -9.089 -9.089 -9.089 -9.089 -9.089 -4.492 -9.089 -9.089 -9.089 electronvolt
mo.energy: -7.320 electronvolt
energy: -9.089 -9.089 -9.089 -9.089 -9.089 -9.089 -9.089 -9.089 -9.089 -9.089 -4.492 -9.089 -9.089 -9.089 -9.089 -9.089 -9.089 -9.089 -9.089 -9.089 -9.089 -9.089 -9.089 10.371 -9.089 -9.089 electronvolt
mo.energy: -7.307 electronvolt
energy: -9.089 -9.089 -9.089 -9.089 -9.089 -9.089 -9.089 -9.089 -9.089 -9.089 -9.089 -9.089 -9.089 -9.089 -9.089 -9.089 -9.089 -9.089 -9.089 -9.089 -9.089 -9.089 -9.089 -9.089 -9.089 -9.089 -9.089 -9.089 -9.089 -9.089 -9.089 -9.089 -9.089 -9.089 electronvolt
mo.energy: -7.217 electronvolt
energy: -9.089 -9.089 -9.089 -9.089 -9.089 -9.089 -9.089 -9.089 -9.089 -9.089 -9.089 -9.089 -9.089 -9.089 -9.089 -9.089 -9.089 -9.089 -9.089 -9.089 -9.089 -9.089 -9.089 -9.089 -9.089 -9.089 -9.089 -9.089 -9.089 -9.089 electronvolt
mo.energy: -7.074 electronvolt
energy: -9.089 -9.089 -9.089 -9.089 -9.089 -9.089 -9.089 -9.089 -9.089 -9.089 -9.089 -4.492 -4.492 -4.492 -4.492 -4.492 -9.089 -9.089 -4.492 -9.089 -9.089 -4.492 -9.089 -4.492 electronvolt
mo.energy: -7.051 electronvolt
energy: -9.089 -9.089 -9.089 -9.089 -9.089 -9.089 -9.089 -9.089 -9.089 -9.089 -9.089 -9.089 -9.089 -9.089 -9.089 -9.089 -9.089 -9.089 -9.089 -9.089 electronvolt
mo.energy: -7.047 electronvolt
energy: -9.089 -9.089 -9.089 -9.089 -9.089 -9.089 -9.089 -9.089 -9.089 -9.089 -9.089 -9.089 -9.089 -9.089 -9.089 -9.089 -9.089 -9.089 -9.089 -9.089 -9.089 -9.089 -9.089 -9.089 electronvolt
mo.energy: -7.046 electronvolt
energy: -9.089 -9.089 -9.089 -9.089 -9.089 -9.089 -9.089 -9.089 -9.089 -9.089 -9.089 -9.089 -9.089 -9.089 -9.089 -9.089 -9.089 -9.089 -4.492 -9.089 -9.089 electronvolt
mo.energy: -6.862 electronvolt
energy: -9.089 -9.089 -9.089 -9.089 -9.089 -9.089 -9.089 -9.089 -9.089 -9.089 -9.089 -9.089 -9.089 -9.089 -9.089 -9.089 -9.089 -9.089 -9.089 -9.089 -9.089 -9.089 -9.089 -9.089 -9.089 -9.089 -9.089 -9.089 -9.089 -9.089 -9.089 electronvolt
energy: -9.089 -9.089 -9.089 -9.089 -9.089 -9.089 -9.089 -9.089 -9.089 -9.089 -9.089 -9.089 -9.089 -9.089 -9.089 -9.089 -9.089 -9.089 -9.089 -9.089 -9.089 -9.089 -9.089 -9.089 -9.089 -9.089 -9.089 -9.089 electronvolt
mo.energy: -6.763 electronvolt
mo.energy: -6.634 electronvolt
energy: -9.089 -9.089 -9.089 -9.089 -9.089 -9.089 -9.089 -9.089 -9.089 -9.089 -9.089 -9.089 -9.089 -9.089 -9.089 -9.089 -9.089 -9.089 -9.089 -9.089 -9.089 -9.089 -9.089 -9.089 -9.089 -9.089 -9.089 -9.089 -9.089 electronvolt
mo.energy: -6.484 electronvolt
mo.energy: -6.483 electronvolt
mo.energy: -6.457 electronvolt
mo.energy: -6.349 electronvolt
energy: -9.089 -9.089 -9.089 -9.089 -9.089 -9.089 -9.089 -9.089 -9.089 -9.089 -9.089 -9.089 -9.089 -9.089 -9.089 -9.089 -9.089 -9.089 -9.089 -9.089 -9.089 -9.089 -9.089 -9.089 -9.089 -9.089 -9.089 electronvolt
mo.energy: -6.256 electronvolt
mo.energy: -6.152 electronvolt
energy: -9.089 -9.089 -9.089 -9.089 -9.089 -9.089 -9.089 -9.089 -9.089 -9.089 -9.089 -9.089 -9.089 -9.089 -9.089 -9.089 -9.089 -9.089 -9.089 -9.089 -9.089 -9.089 -9.089 electronvolt
mo.energy: -6.151 electronvolt
mo.energy: -6.148 electronvolt
mo.energy: -6.031 electronvolt
energy: -9.089 -9.089 -9.089 -9.089 -9.089 -9.089 -9.089 -9.089 -9.089 -9.089 -9.089 -9.089 -9.089 -9.089 -9.089 -9.089 -9.089 -9.089 -9.089 -9.089 -9.089 -9.089 -9.089 -9.089 -9.089 -9.089 -9.089 -9.089 -9.089 -9.089 -9.089 -9.089 -9.089 -9.089 -9.089 -9.089 -9.089 electronvolt
mo.energy: -6.013 electronvolt
mo.energy: -5.950 electronvolt
energy: -9.089 -9.089 -9.089 -9.089 -9.089 -9.089 -9.089 -9.089 -9.089 -9.089 -9.089 -9.089 -9.089 -9.089 -9.089 -9.089 -9.089 -9.089 -9.089 -9.089 -9.089 -9.089 -9.089 -9.089 -9.089 -9.089 -9.089 -9.089 -9.089 -9.089 -9.089 -9.089 -9.089 electronvolt
mo.energy: -5.949 electronvolt
mo.energy: -5.873 electronvolt
energy: -9.089 -9.089 -9.089 -9.089 -9.089 -9.089 -9.089 -9.089 -9.089 -9.089 -9.089 -9.089 -9.089 -9.089 -9.089 -9.089 -9.089 -9.089 -9.089 -9.089 -9.089 electronvolt
mo.energy: -5.872 electronvolt
energy: -9.089 -9.089 -9.089 -9.089 -9.089 -9.089 -9.089 -9.089 -9.089 -9.089 -9.089 -9.089 -9.089 -9.089 -9.089 -9.089 electronvolt
mo.energy: -5.830 electronvolt
mo.energy: -5.709 electronvolt
mo.energy: -5.708 electronvolt
energy: -9.089 -9.089 -9.089 -9.089 -9.089 -9.089 -9.089 -9.089 -9.089 -9.089 -9.089 -9.089 -9.089 -9.089 -9.089 -9.089 -9.089 -9.089 -9.089 -9.089 -9.089 -9.089 -9.089 -9.089 -9.089 -9.089 electronvolt
mo.energy: -5.660 electronvolt
mo.energy: -5.659 electronvolt
mo.energy: -5.648 electronvolt
energy: -9.089 -9.089 -9.089 -9.089 -9.089 -9.089 -9.089 -9.089 -9.089 -9.089 -9.089 -9.089 -9.089 -9.089 -9.089 -9.089 -9.089 -9.089 -9.089 -9.089 -9.089 -9.089 -9.089 -9.089 -9.089 electronvolt
mo.energy: -5.630 electronvolt
mo.energy: -5.577 electronvolt
mo.energy: -5.544 electronvolt
mo.energy: -5.528 electronvolt
mo.energy: -5.527 electronvolt
mo.energy: -5.443 electronvolt
mo.energy: -5.297 electronvolt
mo.energy: -5.230 electronvolt
mo.energy: -5.019 electronvolt
mo.energy: -5.018 electronvolt
mo.energy: -1.931 electronvolt
energy: -4.492 -4.492 -4.492 -4.492 -4.492 -4.492 -9.089 -9.089 -4.492 -4.492 -4.492 -9.089 -9.089 -9.089 -4.492 -9.089 -4.492 -4.492 -4.492 -4.492 -4.492 -9.089 -4.492 -4.492 -4.492 -9.089 electronvolt
mo.energy: -1.858 electronvolt
energy: -4.492 -4.492 -4.492 -4.492 -9.089 -9.089 -4.492 -9.089 -9.089 -4.492 -9.089 -4.492 -4.492 -4.492 -9.089 -4.492 -9.089 -9.089 -9.089 -4.492 -4.492 -4.492 -4.492 -9.089 -9.089 -9.089 electronvolt
energy: -4.492 -4.492 -4.492 -4.492 -4.492 -9.089 -9.089 -9.089 -4.492 -9.089 -9.089 -4.492 -9.089 -9.089 -4.492 -9.089 -9.089 -4.492 -9.089 -4.492 -4.492 -9.089 -9.089 -4.492 -4.492 -4.492 electronvolt
mo.energy: -1.677 electronvolt
energy: -4.492 -4.492 -4.492 -9.089 -9.089 -4.492 -4.492 -4.492 -9.089 -9.089 -4.492 -4.492 -9.089 -9.089 -4.492 -4.492 -4.492 -4.492 -4.492 -4.492 -4.492 -4.492 -4.492 -4.492 -9.089 -4.492 -9.089 -4.492 -9.089 -4.492 electronvolt
mo.energy: -1.620 electronvolt
energy: -4.492 -4.492 -4.492 -4.492 -9.089 -9.089 -4.492 -4.492 -4.492 -9.089 -4.492 -4.492 -9.089 -4.492 -9.089 -4.492 -4.492 -4.492 -4.492 -4.492 -4.492 -4.492 -9.089 -4.492 -9.089 electronvolt
mo.energy: -1.619 electronvolt
energy: -4.492 -4.492 -4.492 -4.492 -9.089 -9.089 -4.492 -4.492 -4.492 -4.492 -4.492 -4.492 -4.492 -4.492 -4.492 -4.492 -9.089 -4.492 -4.492 -9.089 -9.089 -9.089 -4.492 -4.492 -9.089 -9.089 -4.492 -9.089 electronvolt
mo.energy: -1.409 electronvolt
energy: -4.492 -4.492 -4.492 -4.492 -4.492 -9.089 -9.089 -9.089 -4.492 -9.089 -4.492 -4.492 -9.089 -4.492 -9.089 -4.492 -4.492 -4.492 -4.492 -9.089 -9.089 -4.492 -9.089 -9.089 -4.492 electronvolt
mo.energy: -1.407 electronvolt
energy: -4.492 -4.492 -4.492 -4.492 -4.492 -4.492 -9.089 -9.089 -4.492 -4.492 -4.492 -9.089 -9.089 -9.089 -9.089 -4.492 -9.089 -4.492 -4.492 -4.492 -9.089 -9.089 -9.089 -4.492 electronvolt
mo.energy: -1.347 electronvolt
energy: -4.492 -4.492 -4.492 -4.492 -4.492 -4.492 -9.089 -9.089 -9.089 -9.089 -9.089 -4.492 -4.492 -9.089 -4.492 -4.492 -4.492 -4.492 -4.492 -4.492 electronvolt
mo.energy: -1.332 electronvolt
energy: -4.492 -4.492 -4.492 -4.492 -9.089 -9.089 -9.089 -4.492 -4.492 -9.089 -4.492 -4.492 -4.492 -4.492 -4.492 -4.492 -4.492 -9.089 -9.089 -4.492 electronvolt
mo.energy: -1.331 electronvolt
energy: -4.492 -4.492 -4.492 -9.089 -9.089 -4.492 -4.492 -4.492 -4.492 -9.089 -4.492 -4.492 -4.492 -4.492 -4.492 -4.492 -9.089 -9.089 -9.089 -4.492 -4.492 -4.492 electronvolt
mo.energy: -1.283 electronvolt
energy: -4.492 -4.492 -4.492 -4.492 -4.492 -4.492 -4.492 -4.492 -4.492 -4.492 -4.492 -4.492 -4.492 -4.492 -4.492 -4.492 -4.492 -4.492 -4.492 -4.492 -9.089 -9.089 -9.089 -9.089 -4.492 -4.492 -4.492 electronvolt
mo.energy: -1.098 electronvolt
energy: -4.492 -4.492 -4.492 -4.492 -4.492 -4.492 -4.492 -4.492 -4.492 -4.492 -4.492 -4.492 -4.492 -9.089 -4.492 -9.089 -9.089 -9.089 -9.089 -9.089 -4.492 -4.492 -4.492 -9.089 -9.089 -9.089 -9.089 -4.492 electronvolt
energy: -4.492 -4.492 -4.492 -4.492 -4.492 -4.492 -4.492 -4.492 -4.492 -4.492 -4.492 -4.492 -9.089 -4.492 -9.089 -4.492 -9.089 -9.089 -4.492 -4.492 -4.492 -4.492 -9.089 -4.492 -9.089 -4.492 -9.089 -4.492 -4.492 -9.089 -9.089 -9.089 electronvolt
mo.energy: -0.931 electronvolt
energy: -4.492 -4.492 -4.492 -9.089 -9.089 -9.089 -4.492 -4.492 -4.492 -4.492 -4.492 -4.492 -4.492 -4.492 -4.492 -4.492 -4.492 -9.089 -9.089 -4.492 -4.492 -4.492 -4.492 -4.492 -4.492 electronvolt
mo.energy: -0.819 electronvolt
energy: -4.492 -4.492 -4.492 -4.492 -4.492 -4.492 -4.492 -9.089 -9.089 -4.492 -4.492 -4.492 -9.089 -4.492 -4.492 -4.492 -9.089 -4.492 -4.492 -4.492 -4.492 -4.492 -4.492 -9.089 -4.492 4.055 electronvolt
energy: -4.492 -4.492 -4.492 -4.492 -4.492 -4.492 -4.492 -9.089 -4.492 -4.492 -4.492 -9.089 -4.492 -9.089 -4.492 -4.492 -9.089 -9.089 -4.492 -4.492 -4.492 -4.492 4.055 -9.089 -4.492 -4.492 -9.089 -9.089 -9.089 -9.089 -9.089 electronvolt
mo.energy: -0.679 electronvolt
energy: -4.492 -4.492 -4.492 -4.492 -4.492 -4.492 -4.492 -4.492 -4.492 -9.089 -9.089 -9.089 -9.089 -9.089 -9.089 -9.089 -9.089 -9.089 -4.492 -4.492 -4.492 -4.492 electronvolt
mo.energy: -0.678 electronvolt
energy: -4.492 -4.492 -4.492 -4.492 -4.492 -4.492 -9.089 -9.089 -9.089 -4.492 -4.492 -9.089 -4.492 -9.089 -9.089 -4.492 -4.492 -9.089 -4.492 -9.089 -9.089 -4.492 -9.089 -9.089 -9.089 -4.492 electronvolt
mo.energy: -0.635 electronvolt
energy: -4.492 -4.492 -4.492 -4.492 -4.492 -4.492 -4.492 -4.492 -4.492 -4.492 -4.492 -4.492 -9.089 -9.089 -9.089 -4.492 -14.028 -4.492 -4.492 -4.492 -9.089 -9.089 -4.492 -9.089 -4.492 -9.089 -9.089 electronvolt
mo.energy: -0.573 electronvolt
energy: -4.492 -4.492 -4.492 -4.492 -4.492 -4.492 -4.492 -4.492 -4.492 -4.492 -9.089 -9.089 -9.089 -4.492 -9.089 -9.089 -9.089 -9.089 -9.089 -4.492 -4.492 -4.492 -4.492 -9.089 -9.089 1.232 -4.492 -4.492 -9.089 -4.492 electronvolt
mo.energy: -0.572 electronvolt
energy: -4.492 -4.492 -4.492 -4.492 -4.492 -4.492 -9.089 -4.492 -9.089 -9.089 -4.492 -4.492 -4.492 -4.492 -9.089 -9.089 -4.492 -9.089 -9.089 -4.492 -4.492 4.055 -4.492 -9.089 -4.492 -9.089 -9.089 -9.089 -4.492 -4.492 1.232 electronvolt
mo.energy: -0.502 electronvolt
energy: -4.492 -4.492 -4.492 -4.492 -4.492 -4.492 -4.492 -4.492 -4.492 -4.492 -4.492 -4.492 -4.492 -9.089 -4.492 -9.089 -9.089 -4.492 -9.089 -9.089 -4.492 -9.089 -4.492 -4.492 -4.492 -4.492 -9.089 -4.492 -9.089 -9.089 -4.492 electronvolt
mo.energy: -0.380 electronvolt
energy: -4.492 -4.492 -4.492 -4.492 -4.492 -4.492 -4.492 -4.492 -4.492 -4.492 -4.492 -4.492 -4.492 -9.089 -9.089 -9.089 -4.492 -9.089 -9.089 -9.089 -9.089 -9.089 -9.089 -9.089 -9.089 -9.089 -9.089 -4.492 electronvolt
mo.energy: -0.234 electronvolt
energy: -4.492 -4.492 -4.492 -4.492 -9.089 -4.492 -9.089 -9.089 -9.089 -4.492 -9.089 -4.492 -4.492 -9.089 -9.089 -4.492 -4.492 -9.089 -9.089 4.055 -9.089 -9.089 -4.492 electronvolt
mo.energy: -0.233 electronvolt
energy: -4.492 -4.492 -4.492 -4.492 -4.492 -9.089 -4.492 -9.089 -4.492 -9.089 -4.492 -9.089 -9.089 -9.089 -4.492 -9.089 -4.492 -4.492 -9.089 -9.089 -4.492 -9.089 -9.089 -4.492 electronvolt
mo.energy: -0.153 electronvolt
energy: -4.492 -4.492 -4.492 -4.492 -4.492 -4.492 -4.492 -4.492 -4.492 -4.492 -4.492 -4.492 -4.492 -4.492 -4.492 -4.492 -9.089 -9.089 -9.089 -4.492 -9.089 -9.089 -9.089 -9.089 -4.492 -9.089 electronvolt
mo.energy: 0.296 electronvolt
energy: 1.232 1.232 1.232 1.232 1.232 1.232 1.232 1.232 1.232 3.429 -5.688 -5.688 -5.688 -5.688 -5.688 -5.688 -14.028 -5.688 -5.688 -5.688 electronvolt
mo.energy: 0.687 electronvolt
energy: -4.492 -4.492 -4.492 -4.492 -4.492 -4.492 -4.492 -14.028 -4.492 -4.492 -4.492 -4.492 -4.492 -4.492 -4.492 -9.089 -4.492 -9.089 -9.089 -4.492 -9.089 -4.492 -4.492 -9.089 -4.492 -4.492 -9.089 -9.089 -9.089 electronvolt
mo.energy: 0.718 electronvolt
energy: 1.232 1.232 -5.688 -5.688 1.232 2.224 1.232 1.232 -5.688 2.224 1.232 -5.688 -5.688 1.232 -5.688 -5.688 1.232 -5.485 -5.485 -5.688 electronvolt
energy: 1.232 1.232 1.232 1.232 -5.688 2.224 -5.688 -5.688 1.232 -5.688 -5.688 2.224 1.232 -5.485 -5.688 1.232 1.232 electronvolt
mo.energy: 0.934 electronvolt
energy: 1.232 1.232 1.232 -5.688 -5.688 -5.688 1.232 1.232 1.232 1.232 1.232 1.232 -5.688 -5.688 -5.688 -5.688 -5.688 -5.688 electronvolt
mo.energy: 1.096 electronvolt
energy: -4.492 -4.492 -4.492 -9.089 -4.492 -9.089 -9.089 -14.028 -4.492 -0.504 -0.504 -4.492 -0.504 -24.020 -4.492 24.654 -4.492 -4.492 -4.492 -9.089 -9.089 -9.089 -4.492 electronvolt
mo.energy: 1.196 electronvolt
energy: -5.688 1.232 1.232 -5.688 -5.688 1.232 -5.688 1.232 1.232 -5.688 -5.688 -5.688 1.232 1.232 -4.492 -4.492 -4.492 -0.504 electronvolt
mo.energy: 1.197 electronvolt
energy: -5.688 1.232 1.232 -5.688 -5.688 1.232 -5.688 1.232 -5.688 1.232 -5.688 -5.688 1.232 1.232 -4.492 -4.492 -0.504 electronvolt
mo.energy: 1.321 electronvolt
energy: -4.492 -4.492 -4.492 -4.492 -4.492 -4.492 -4.492 -4.492 -9.089 -9.089 -4.492 -4.492 -0.504 -4.492 -4.492 -0.504 -9.089 -4.492 -4.492 -4.492 -5.688 -4.492 -5.688 -9.089 -4.492 -4.492 -4.492 electronvolt
mo.energy: 1.323 electronvolt
energy: -4.492 -4.492 -4.492 -4.492 -4.492 -4.492 -4.492 -4.492 -4.492 -9.089 -4.492 -9.089 -4.492 -5.688 -9.089 -4.492 -0.504 -5.485 -9.089 -9.089 -0.504 -4.492 -9.089 -4.492 electronvolt
mo.energy: 1.460 electronvolt
energy: -5.688 1.232 -5.688 1.232 -5.688 1.232 -5.688 -5.688 -5.688 1.232 1.232 1.232 -5.688 1.232 -0.504 -4.492 -4.492 electronvolt
energy: -5.688 1.232 -5.688 1.232 -5.688 -5.688 1.232 1.232 -5.688 1.232 -0.504 -4.492 1.232 -5.688 -0.504 -4.492 -5.688 1.232 electronvolt
mo.energy: 1.692 electronvolt
energy: -4.492 -4.492 -4.492 -4.492 -4.492 -4.492 -4.492 -4.492 -9.089 -4.492 -4.492 -4.492 -0.504 -9.089 -4.492 -9.089 -9.089 -4.492 -5.688 -4.492 -4.492 -5.688 -9.089 electronvolt
mo.energy: 1.693 electronvolt
energy: -4.492 -4.492 -4.492 -4.492 -4.492 -4.492 -4.492 -4.492 -4.492 -4.492 -4.492 -4.492 -9.089 -9.089 -4.492 -4.492 -4.492 -9.089 -4.492 -9.089 -5.688 -5.688 -0.504 -9.089 -0.504 -9.089 electronvolt
mo.energy: 1.753 electronvolt
energy: -5.688 -5.688 -5.688 -5.688 -5.688 -5.688 1.232 1.232 1.232 1.232 1.232 1.232 electronvolt
mo.energy: 2.114 electronvolt
energy: -4.492 -4.492 -4.492 -4.492 -4.492 -4.492 1.232 -4.492 1.232 -4.492 -9.089 -4.492 -9.089 -4.492 -9.089 -9.089 -4.492 1.232 -4.492 -9.089 -9.089 -9.089 -4.492 1.232 -9.089 -9.089 -9.089 -5.485 -9.089 -4.492 -5.485 -0.504 -9.089 -9.089 electronvolt
mo.energy: 2.115 electronvolt
energy: -4.492 -4.492 -4.492 -4.492 -4.492 -4.492 1.232 -4.492 1.232 -9.089 -9.089 -9.089 -4.492 -4.492 -4.492 -4.492 -9.089 -9.089 -4.492 -4.492 1.232 -4.492 -0.504 -5.485 -9.089 1.232 electronvolt
mo.energy: 2.250 electronvolt
energy: 2.224 2.224 -4.492 -4.492 -4.492 -4.492 -4.492 2.224 -4.492 -4.492 -4.492 -4.492 -4.492 -4.492 -4.492 -4.492 -4.492 -4.492 -4.492 -4.492 -4.492 -4.492 -4.492 -4.492 -0.504 electronvolt
mo.energy: 2.323 electronvolt
energy: -4.492 -4.492 -4.492 -4.492 -4.492 -4.492 -4.492 -4.492 -4.492 -9.089 -9.089 -9.089 -9.089 -4.492 -9.089 -4.492 -4.492 -9.089 -4.492 -9.089 -4.492 -9.089 -9.089 -4.492 -9.089 -4.492 -9.089 electronvolt
mo.energy: 2.539 electronvolt
energy: 2.224 2.224 -14.028 2.224 -5.485 3.429 -5.485 -5.485 9.585 9.585 9.585 9.585 9.585 4.055 4.055 9.585 4.055 4.055 44.824 4.055 4.055 electronvolt
mo.energy: 2.556 electronvolt
energy: -4.492 -4.492 -4.492 -4.492 -4.492 -4.492 -4.492 -4.492 -4.492 -4.492 -5.485 -4.492 -4.492 -4.492 -4.492 -4.492 -9.089 -9.089 -4.492 -9.089 -4.492 1.232 -9.089 -5.485 -9.089 -9.089 -4.492 -9.089 -9.089 -9.089 -4.492 1.232 electronvolt
mo.energy: 2.558 electronvolt
energy: -4.492 -4.492 -4.492 -4.492 -4.492 -4.492 -4.492 -4.492 -4.492 -4.492 -4.492 -5.485 -9.089 -4.492 -9.089 -4.492 -9.089 -5.485 -9.089 -9.089 -9.089 1.232 -4.492 -4.492 -4.492 -4.492 -9.089 electronvolt
mo.energy: 3.035 electronvolt
energy: -4.492 1.232 -4.492 -4.492 -9.089 -4.492 -4.492 -4.492 -4.492 -5.688 -4.492 -4.492 -4.492 -4.492 -4.492 -4.492 -4.492 -4.492 1.232 -9.089 -9.089 -9.089 1.232 4.055 -5.485 1.232 -4.492 -9.089 1.232 -9.089 -9.089 -4.492 4.055 electronvolt
mo.energy: 3.036 electronvolt
energy: -4.492 -4.492 -4.492 1.232 -4.492 1.232 -9.089 -9.089 -4.492 -4.492 -4.492 -4.492 -5.688 -4.492 -4.492 -5.688 -4.492 -4.492 -9.089 -4.492 -4.492 -9.089 -4.492 -9.089 1.232 -5.485 -4.492 1.232 -4.492 -4.492 -9.089 4.055 4.055 -9.089 electronvolt
