program: Gaussian 09
title: 000046347
version: EM64L-G09RevD.01
frameworkgroup: C1[X(C12H21O6P)]
method: RPBEPBE
basis: SDD
operation: Freq
keyword: #p
keyword: freq=noraman
keyword: PBEPBE/SDD
title: #p freq=noraman PBEPBE/SDD
converged: YES YES NO NO
title: Mulliken charges:
elementType: P O O O O O O C C C C C C C C C C C C H H H H H H H H H H H H H H H H H H H H H
charge: 1.410245 -0.289236 -0.276351 -0.541795 -0.521138 -0.493117 -0.579479 0.049120 -0.446038 -0.434825 -0.396392 -0.400076 -0.387324 0.233863 -0.469817 0.432925 -0.767466 -0.481135 -0.477348 0.226526 0.209322 0.213756 0.235662 0.203562 0.195442 0.205085 0.198268 0.204082 0.201064 0.191664 0.300768 0.234432 0.239284 0.300743 0.243331 0.246390 0.248140 0.254808 0.236926 0.246129
chargesum: 0.00000
title: Mulliken charges with hydrogens summed into heavy atoms:
elementType: P O O O O O O C C C C C C C C C C C C
charge: 1.410245 -0.289236 -0.276351 -0.541795 -0.521138 -0.493117 -0.579479 0.275646 -0.022961 0.004399 0.004135 0.002274 0.005404 0.233863 -0.169048 0.432925 0.006993 0.256726 0.260516
polarizability: 2.45460880e+02 -9.79285310e+00 1.58153224e+02 -1.18961598e+00 2.72625814e+00 1.43595363e+02
1716.lowfreq: -29.1116 -5.3055 -2.1846 -0.0015 -0.0010 0.0010 6.5361 17.6684 34.0428
frequency: -20.2915 14.4171 33.9448 35.0313 47.5444 59.2983 73.4657 86.8575 88.6088 102.1255 119.1095 136.9086 139.1778 156.9076 181.6053 195.5898 207.8583 216.6502 250.0461 253.8168 276.5578 291.6813 326.8931 345.4955 346.5877 388.8029 421.4787 429.2010 444.3330 462.5580 473.3509 501.7196 549.3542 599.7024 658.0639 692.6182 705.5452 726.7220 785.6967 788.1365 840.0994 855.6282 880.7207 887.6956 895.5935 904.7610 922.5264 961.3942 965.8599 979.2344 999.6495 1021.8318 1044.8355 1051.9308 1052.3532 1067.6673 1081.8418 1106.3290 1110.0607 1112.5360 1114.6677 1129.1032 1133.5972 1151.9526 1197.8699 1202.6659 1241.3906 1253.0889 1258.4502 1301.4007 1308.6357 1331.5169 1335.9397 1337.8005 1347.3511 1357.4431 1370.5078 1398.3437 1424.3629 1426.3379 1445.9865 1457.7350 1461.5371 1461.6697 1464.3927 1465.7562 1469.4496 1470.6330 1471.1815 1472.9806 1479.3466 1597.9016 1647.2010 2969.7641 2970.3750 2971.7859 2986.9289 2987.6634 2989.7865 2992.0238 2998.8882 3006.5298 3032.9143 3035.2295 3043.8536 3056.7822 3065.4478 3069.8040 3097.5044 3108.5242 3120.3782 3137.1123 3141.3182 3149.8627
redmass: 3.2945 4.2409 4.4443 3.6631 4.1700 4.1595 3.7343 3.6430 3.4676 1.1087 1.2048 1.3327 1.9467 4.4818 4.4296 5.6827 3.5163 2.1469 4.3693 5.3257 6.9021 5.0007 1.9699 6.7713 5.1949 5.9617 5.4729 3.1768 2.9073 2.6577 4.7261 2.6881 2.8798 5.9395 7.8867 5.8823 10.7780 7.4471 1.8379 1.7372 2.3749 4.1682 1.8465 1.4761 1.6121 3.6247 1.7452 9.7852 8.3804 6.4305 2.7445 2.0474 1.7567 1.2322 1.3509 8.7425 1.3271 2.4622 2.6317 1.2376 1.2698 1.2777 1.3027 2.3154 1.5735 4.3071 1.3127 1.2787 1.3009 1.1935 1.3153 1.3630 1.4715 1.4629 1.5274 1.4398 1.4498 1.4477 1.1211 1.1232 1.0871 1.0520 1.0501 1.0874 1.0889 1.0920 1.0824 1.0538 1.0532 1.0475 1.0959 9.3932 6.8306 1.0664 1.0612 1.0625 1.0364 1.0625 1.0649 1.0294 1.0289 1.0811 1.0957 1.0978 1.1009 1.1021 1.1025 1.0971 1.1063 1.1052 1.1000 1.1036 1.1052 1.0917
irintensity: 0.9477 1.0906 0.6976 4.1229 0.3489 6.1727 4.9343 0.4910 2.9706 0.0332 1.8514 1.1706 1.3655 1.3277 0.3131 1.5446 2.8096 0.6229 8.2945 1.7580 11.9339 28.9985 3.4520 20.6478 7.2497 50.1531 8.3787 4.8817 6.1179 19.7240 12.3179 1.9127 6.0738 13.8836 283.3470 10.2965 92.5384 63.1480 2.0218 1.0798 0.3419 102.9108 3.5268 44.3017 18.8895 26.0201 3.6608 397.6241 408.0005 95.5205 70.7567 118.6937 5.9187 1.0060 4.1560 65.6913 15.3857 332.2906 101.7612 1.0997 13.4079 1.3495 1.2734 0.7442 8.6287 130.1264 0.2522 2.2311 6.5429 0.6754 0.7958 0.4046 16.2802 1.2591 0.6622 61.3999 28.5277 63.2586 3.5245 1.6323 58.1521 10.1242 15.8104 3.5764 9.1308 8.6141 20.3811 13.5620 19.5446 19.0721 5.5228 187.7667 480.9745 34.5829 35.7232 36.0347 26.9261 7.6436 14.2243 42.1474 35.2605 26.1481 68.3696 64.0662 45.6511 28.0426 59.0466 12.0890 22.1267 25.9930 4.6101 13.8054 9.3283 5.0481
temp: 298.150 k
press: 1.00000 atm
elementType: 15 8 8 8 8 8 8 6 6 6 6 6 6 6 6 6 6 6 6 1 1 1 1 1 1 1 1 1 1 1 1 1 1 1 1 1 1 1 1 1
symmnumber: 1
zpe: 845022.2 jmol-1
zpe.correction: 0.321852 hartree
zpe.thermalcorrener: 0.343890 hartree
zpe.thermalcorrenthalpy: 0.344834 hartree
zpe.thermalcorrgfe: 0.268043 hartree
zpe.sumelectzpe: -1260.907475 hartree
zpe.sumelectthermal: -1260.885437 hartree
zpe.sumelectthermalent: -1260.884493 hartree
zpe.sumelectthermalfe: -1260.961285 hartree
dipole: -2.3005 1.8648 0.8032
dipole: 3.0684
quadrupole: -90.7704 -128.9106 -113.3880
quadrupole: -12.1808 -2.1528 -6.1601
quadrupole: 20.2526 -17.8876 -2.3650 -12.1808 -2.1528 -6.1601
hfenergy: -1261.2293275 hartree
pointgroup: C01 [X(C12H21O6P1)]
dipole: 0.9271621 0.7728335 -0.0208776 debye
polarizability: 245.7128309|7.297596|156.826459|-5.4553518|3.727214|144.6701766 unknown
InChI: InChI=1S/C12H21O6P/c1-10(18-19(14,15-2)16-3)9-12(13)17-11-7-5-4-6-8-11/h9,11H,4-8H2,1-3H3
charge 0 multiplicity 1
40 atoms
P  3.472654 -1.085007 -0.462671
O  -1.683046 -0.364597 -0.093495
O  -1.228486 1.908878 0.218009
O  3.000332 0.547973 0.026296
O  5.144909 -0.938891 -0.113163
O  3.48284 -1.051876 -2.166794
O  2.664732 -2.289383 0.164121
C  -3.153651 -0.068849 -0.077502
C  -3.826107 -1.196813 -0.871372
C  -3.660958 0.004403 1.374536
C  -5.365502 -1.019035 -0.853866
C  -5.200039 0.185936 1.391543
C  -5.908557 -0.935274 0.593662
C  -0.815309 0.725097 0.064406
C  0.574748 0.238178 0.000087
C  1.673337 1.044767 0.121122
C  1.725194 2.523041 0.380944
C  5.589421 -0.993601 1.301397
C  4.291499 -0.039624 -2.897293
H  -3.302828 0.911803 -0.571345
H  -3.554302 -2.167357 -0.411886
H  -3.442246 -1.205559 -1.908213
H  -3.164666 0.838695 1.901948
H  -3.388212 -0.936445 1.892525
H  -5.635792 -0.090953 -1.399077
H  -5.841679 -1.857387 -1.396889
H  -5.45818 1.170242 0.948919
H  -5.559893 0.203524 2.437802
H  -7.001988 -0.762377 0.580802
H  -5.741406 -1.906709 1.103157
H  0.684018 -0.841972 -0.14464
H  2.258344 3.036293 -0.440096
H  2.288778 2.718731 1.311613
H  0.704361 2.923354 0.469107
H  5.251495 -0.092686 1.842578
H  6.687192 -1.017503 1.245754
H  5.211324 -1.907094 1.792996
H  5.361781 -0.170708 -2.668877
H  3.963179 0.981561 -2.636208
H  4.086912 -0.250373 -3.956836
