program: Gaussian 09
title: 000046323
version: EM64L-G09RevD.01
frameworkgroup: C1[X(C16H26O)]
method: RPBEPBE
basis: SDD
operation: Freq
keyword: #pfreq=noraman
keyword: PBEPBE/SDD
title: #p freq=noraman PBEPBE/SDD
converged: YES YES NO NO
title: Mulliken charges:
elementType: O C C C C C C C C C C C C C C C C H H H H H H H H H H H H H H H H H H H H H H H H H H
charge: -0.426565 -0.386368 -0.381287 -0.362927 -0.372601 -0.396041 -0.353342 -0.619145 -0.356618 0.384874 -0.696266 0.096611 -0.406090 -0.499385 0.478093 -0.451376 -0.809580 0.194796 0.197007 0.192695 0.191760 0.188656 0.197203 0.190445 0.190240 0.222932 0.211685 0.187644 0.187885 0.234965 0.201038 0.195100 0.195187 0.215553 0.209626 0.209667 0.229312 0.249428 0.227307 0.227435 0.232175 0.221754 0.356516
chargesum: 0.00000
title: Mulliken charges with hydrogens summed into heavy atoms:
elementType: O C C C C C C C C C C C C C C C C
charge: -0.070049 0.005436 0.003168 0.022932 0.008085 0.038577 0.022186 -0.183142 0.033669 0.384874 -0.061420 0.096611 -0.176778 -0.249957 0.478093 -0.224069 -0.128216
polarizability: 2.42758333e+02 -3.56470199e+00 1.61042964e+02 2.37244317e+01 8.74663390e-01 1.33094392e+02
1716.lowfreq: -28.5418 -15.2210 -4.8582 -0.0008 0.0004 0.0009 2.2337 18.2210 22.7847
frequency: -28.1477 17.4770 22.4156 27.9304 45.0160 62.0693 76.2265 89.5204 120.5611 127.0042 134.5516 148.6082 152.4024 207.9239 216.0992 222.2283 277.1531 282.5480 304.6727 312.7464 339.1900 378.3703 440.2305 448.6553 471.9867 477.7399 524.9670 550.0028 593.9002 715.4842 720.7700 724.9331 731.0110 735.5443 762.5502 775.9419 810.9472 819.6153 876.3121 883.3480 887.2343 928.0857 944.7325 951.3035 988.9914 990.4108 998.4116 1012.3941 1034.9244 1046.8733 1050.4129 1066.5899 1069.2171 1079.1293 1080.4888 1119.7112 1125.2775 1137.8935 1170.9386 1183.8981 1209.6004 1212.8309 1221.5664 1244.0580 1246.9840 1262.5920 1275.6341 1280.9860 1282.9271 1288.6301 1293.3128 1295.9585 1296.5923 1313.4116 1336.7116 1350.5001 1354.8904 1356.6991 1382.5335 1388.7851 1396.7319 1433.6652 1460.0924 1460.4640 1463.8970 1467.4402 1469.9612 1473.1047 1475.1560 1476.0404 1478.9958 1483.7969 1487.8642 1495.3018 1502.0504 1583.6930 1638.3392 2930.2624 2948.6710 2950.3899 2951.1795 2955.3580 2962.1603 2968.5851 2971.6399 2971.7841 2975.8411 2983.8920 2988.5096 2996.3404 3008.9767 3018.2783 3027.2100 3038.6007 3047.1504 3055.1693 3068.2295 3070.6771 3084.0607 3113.5968 3140.7506 3148.0405 3582.5177
redmass: 1.0260 3.2571 2.5393 2.4307 3.8956 3.6058 1.5990 3.1093 1.7588 3.4546 2.3586 2.2827 3.3011 3.2601 3.8399 1.1365 2.8989 2.7636 2.2355 1.4744 3.6064 3.1325 3.0043 3.4825 3.2194 3.0032 4.2432 5.4243 3.5593 4.6605 1.0616 1.0907 3.2904 1.1682 1.2073 3.0792 1.2488 1.3545 1.2800 1.4267 1.9001 2.4321 1.4011 1.3596 4.0613 4.9418 1.5331 1.1524 3.6132 1.5632 2.9661 1.9235 1.7829 2.1589 2.2834 2.6409 2.1095 1.3460 1.4234 1.8210 1.2789 1.5307 1.8748 1.3937 1.3327 1.7922 1.2958 1.0858 1.3334 1.1457 1.1992 1.2332 1.1919 1.4059 1.4444 1.5490 1.6526 1.6229 3.9409 1.2173 1.2994 2.9828 1.0727 1.0726 1.0684 1.0783 1.0568 1.0788 1.1052 1.0426 1.1039 1.0970 1.0917 1.1138 3.1986 6.1615 6.8272 1.0688 1.0590 1.0588 1.0591 1.0593 1.0591 1.0588 1.0612 1.0378 1.0375 1.0961 1.0970 1.0997 1.1011 1.0966 1.1019 1.1035 1.1026 1.0968 1.1007 1.0993 1.0991 1.0875 1.0954 1.0928 1.0654
irintensity: 0.4457 0.0639 0.0765 0.0456 0.0710 0.0298 0.0041 0.0613 0.0212 0.3705 0.0578 0.0158 0.1399 5.5433 1.1796 0.0005 15.4159 4.7366 32.8646 74.4940 1.5196 3.7469 5.4034 2.4823 6.7807 3.9981 0.8765 0.6955 7.1303 2.7502 14.3095 0.3697 1.1840 3.8034 1.4109 7.6153 12.2127 25.2462 1.1461 9.9262 5.0983 20.3989 1.7882 9.8761 0.8984 0.0833 13.0704 1.0590 0.5334 15.6057 1.0626 1.1464 3.7478 0.0624 0.6303 11.0519 22.0441 67.7021 43.3609 0.3052 16.2598 2.2647 37.1442 0.4677 0.9670 12.4821 4.3917 0.9397 1.3470 3.0609 0.2052 2.3810 0.7729 1.0583 0.5491 0.4326 0.3640 0.6616 21.7289 11.3109 5.3568 5.8380 0.0119 0.0261 0.0411 1.3674 14.9844 3.4009 21.8681 11.6606 1.9958 1.3143 21.0279 18.5749 52.6942 29.2449 28.7532 32.2172 6.8029 0.0271 4.9597 0.2009 39.4092 106.1197 105.1514 29.7302 41.5359 1.4806 2.7487 2.2679 3.1593 5.4334 2.1675 52.6688 167.7924 23.0908 98.8621 55.6018 21.2115 14.0954 28.2019 3.1511 26.6099
temp: 298.150 k
press: 1.00000 atm
elementType: 8 6 6 6 6 6 6 6 6 6 6 6 6 6 6 6 6 1 1 1 1 1 1 1 1 1 1 1 1 1 1 1 1 1 1 1 1 1 1 1 1 1 1
symmnumber: 1
zpe: 996460.8 jmol-1
zpe.correction: 0.379532 hartree
zpe.thermalcorrener: 0.399112 hartree
zpe.thermalcorrenthalpy: 0.400057 hartree
zpe.thermalcorrgfe: 0.328304 hartree
zpe.sumelectzpe: -699.192728 hartree
zpe.sumelectthermal: -699.173147 hartree
zpe.sumelectthermalent: -699.172203 hartree
zpe.sumelectthermalfe: -699.243956 hartree
dipole: -1.3785 -1.1540 -0.2983
dipole: 1.8224
quadrupole: -107.4509 -106.0654 -107.5437
quadrupole: -4.6318 3.9306 -0.4331
quadrupole: -0.4309 0.9546 -0.5237 -4.6318 3.9306 -0.4331
hfenergy: -699.5722598 hartree
pointgroup: C01 [X(C16H26O1)]
dipole: -0.5442674 0.3729496 0.2805905 debye
polarizability: 242.4618394|12.8479843|156.6836458|-21.0233316|10.1605561|137.7502043 unknown
InChI: InChI=1S/C16H26O/c1-3-4-5-6-7-8-9-10-15-12-11-14(2)13-16(15)17/h11-13,17H,3-10H2,1-2H3
charge 0 multiplicity 1
43 atoms
O  2.647629 -2.184096 -0.288132
C  -2.363508 0.135995 -0.14195
C  -3.764336 -0.022555 0.491109
C  -1.210968 -0.030356 0.873963
C  -4.916615 0.135727 -0.526647
C  0.187022 0.135896 0.239262
C  -6.318245 -0.018664 0.105595
C  1.342399 -0.021929 1.270334
C  -7.470246 0.133529 -0.914135
C  2.726641 0.110692 0.652994
C  -8.86674 -0.021453 -0.273867
C  3.306581 -0.949054 -0.101554
C  3.48331 1.300043 0.774653
C  4.575869 -0.823782 -0.701914
C  5.31746 0.375157 -0.575317
C  4.754944 1.439444 0.174997
C  6.677721 0.512829 -1.238843
H  -2.243959 -0.607529 -0.957597
H  -2.288404 1.134956 -0.619961
H  -3.886917 0.725367 1.302367
H  -3.838148 -1.019486 0.974402
H  -1.287106 -1.030521 1.351652
H  -1.332472 0.712193 1.6903
H  -4.841696 1.131184 -1.012642
H  -4.795582 -0.614359 -1.336188
H  0.267269 1.13761 -0.226825
H  0.30843 -0.592582 -0.588692
H  -6.393627 -1.012595 0.594838
H  -6.442916 0.734074 0.912198
H  1.219118 0.749327 2.053803
H  1.226277 -0.995535 1.79805
H  -7.394157 1.126115 -1.403518
H  -7.345056 -0.61957 -1.718916
H  -9.672142 0.091609 -1.022861
H  -9.028069 0.73908 0.513482
H  -8.978885 -1.017259 0.195431
H  3.065079 2.131183 1.356342
H  4.972219 -1.675964 -1.264788
H  5.314949 2.374239 0.292855
H  7.32017 -0.361886 -1.02889
H  6.580559 0.589068 -2.338916
H  7.206333 1.41561 -0.887281
H  1.783117 -2.19175 0.192408
