program: Gaussian 09
title: 000047627
version: EM64L-G09RevD.01
frameworkgroup: C1[X(C20H16N4O2)]
method: RPBEPBE
basis: SDD
operation: Freq
keyword: #p
keyword: freq=noraman
keyword: PBEPBE/SDD
title: #p freq=noraman PBEPBE/SDD
converged: YES YES NO NO
title: Mulliken charges:
elementType: O O N N N N C C C C C C C C C C C C C C C C C C C C H H H H H H H H H H H H H H H H
charge: -0.284624 -0.284599 -0.656325 -0.656235 -0.373491 -0.373447 0.303380 0.303440 0.172999 0.172943 0.428236 0.428352 -0.514658 -0.514682 -0.537816 -0.537796 0.366208 0.366061 -0.372078 -0.372015 -0.378558 -0.378470 -0.366666 -0.366883 0.050344 0.050240 0.270917 0.270890 0.299474 0.299468 0.271321 0.271324 0.253062 0.253077 0.228537 0.228771 0.312875 0.315093 0.312857 0.315111 0.211682 0.211681
chargesum: 0.00000
title: Mulliken charges with hydrogens summed into heavy atoms:
elementType: O O N N N N C C C C C C C C C C C C C C C C C C C C
charge: -0.284624 -0.284599 -0.028356 -0.028267 -0.161809 -0.161766 0.303380 0.303440 0.172999 0.172943 0.428236 0.428352 -0.243741 -0.243793 -0.238342 -0.238328 0.366208 0.366061 -0.100758 -0.100691 -0.125496 -0.125393 -0.138129 -0.138112 0.050344 0.050240
polarizability: 7.66073170e+02 2.23779838e+01 2.45712508e+02 6.42489260e-03 5.40067159e-03 1.05512397e+02
1716.lowfreq: -0.0014 0.0012 0.0014 3.4728 4.7920 16.2620 19.8504 28.3550 35.8878
frequency: 19.8497 28.3198 35.8839 49.1782 65.2173 65.8510 97.8924 110.0012 136.1369 142.9917 176.4863 204.8031 206.3842 248.9918 282.2188 292.9201 318.6645 330.6126 350.0240 353.5761 372.1918 422.0145 427.6786 436.2323 438.0032 449.0878 455.9408 456.4721 481.0154 507.0938 515.4066 538.1733 548.1777 572.5244 574.9869 588.5865 593.7315 618.4575 667.1848 679.3095 692.4845 695.8416 720.6461 723.3633 748.4409 752.8635 754.9580 807.2146 807.4817 817.7357 818.6949 825.6880 826.5131 829.0029 841.1747 880.6257 881.5116 890.5680 926.9245 926.9433 938.1027 938.1828 946.2550 946.4067 966.0140 1041.7430 1041.7457 1070.4125 1070.7863 1099.5160 1099.7813 1117.8708 1119.5331 1143.5224 1153.2001 1183.2831 1186.3684 1228.9102 1257.9119 1260.7983 1268.6860 1273.4322 1284.9437 1297.8479 1304.7819 1360.1327 1362.6964 1398.3885 1399.2759 1444.8940 1447.8645 1457.4550 1478.8765 1515.5667 1582.7831 1582.8631 1600.0819 1603.3806 1605.4530 1619.5520 1624.8820 1637.0757 1637.5532 1646.4070 3139.7057 3139.9367 3144.0412 3153.8572 3169.8572 3169.8625 3174.8971 3174.9268 3224.0967 3224.2261 3323.6597 3323.7070 3533.9385 3534.0160 3678.6848 3678.7667
redmass: 6.7374 6.3837 4.7008 6.3094 4.8624 4.6420 6.8027 5.9281 7.1641 6.5719 4.9648 5.5640 3.1267 5.0796 4.4736 3.9976 5.4066 4.0331 3.5701 6.1807 4.7035 1.4732 1.1654 3.0903 2.3650 3.3165 1.1664 1.1895 4.6476 4.0178 3.7848 3.8937 3.3405 4.1633 4.0555 3.9546 4.8292 4.1974 5.0853 5.4403 3.1004 3.4993 5.5342 5.3019 4.4925 3.6634 4.1347 1.4346 1.4358 3.4356 1.6418 1.4045 1.4746 1.5003 4.8105 7.4918 1.9445 5.9981 3.6518 3.6630 1.4978 1.4997 1.3944 1.3931 1.1010 1.7425 1.7435 1.6382 1.6371 1.7403 1.7265 2.0453 1.9595 1.4743 1.2980 1.7561 1.7801 2.6596 3.9089 3.1703 1.9093 1.8672 1.8876 1.8112 1.7590 3.8879 3.9445 4.7024 4.5760 4.2442 4.3918 5.7718 4.2666 5.0531 5.3959 5.3918 5.7451 4.1031 4.8767 5.4807 5.0706 1.4704 1.5231 5.9514 1.0884 1.0884 1.0949 1.0867 1.0930 1.0930 1.0960 1.0960 1.0980 1.0980 1.0762 1.0761 1.0451 1.0451 1.1034 1.1034
irintensity: 0.7043 0.8667 2.9528 1.2685 1.9844 15.1866 0.2074 0.0790 0.0100 4.8617 12.3170 0.7530 0.4184 1.8600 9.5324 5.1779 2.4773 1.9889 4.9674 4.1077 6.7010 114.2801 90.7883 6.9593 68.2595 0.8681 81.3570 229.5344 31.8191 2.5865 0.5784 41.7427 3.0832 47.3836 1.6139 50.6222 0.1374 0.7542 2.8952 1.8914 1.1474 9.8543 2.6984 2.4226 4.4755 0.5088 18.5472 21.7211 17.2188 50.4192 10.3366 204.8481 2.1716 39.7912 1.8251 0.0431 0.2107 67.0189 7.0708 0.7801 56.4572 7.0128 4.9835 5.1367 84.0321 7.5005 6.6314 245.2238 3.7052 189.6580 1.7160 0.1734 8.1032 1.4536 45.7805 0.0442 36.1287 0.0347 0.2108 23.2624 1.2998 40.2940 1.2380 0.2463 3.4785 28.0542 236.2358 183.3914 3.3773 2.1888 3.6620 4.2426 35.7815 1.4693 114.9301 44.9010 44.0429 1.3176 152.7884 0.7789 36.0038 64.7319 324.7384 1.8988 9.5481 8.7822 0.0004 14.8839 5.2764 0.8110 13.0978 0.3123 5.6051 10.7904 82.8314 4.7342 21.2333 19.4904 20.4290 18.8804
temp: 298.150 k
press: 1.00000 atm
elementType: 8 8 7 7 7 7 6 6 6 6 6 6 6 6 6 6 6 6 6 6 6 6 6 6 6 6 1 1 1 1 1 1 1 1 1 1 1 1 1 1 1 1
symmnumber: 1
zpe: 837746.9 jmol-1
zpe.correction: 0.319081 hartree
zpe.thermalcorrener: 0.340995 hartree
zpe.thermalcorrenthalpy: 0.341939 hartree
zpe.thermalcorrgfe: 0.266692 hartree
zpe.sumelectzpe: -1139.373002 hartree
zpe.sumelectthermal: -1139.351088 hartree
zpe.sumelectthermalent: -1139.350144 hartree
zpe.sumelectthermalfe: -1139.425391 hartree
dipole: 0.0008 0.0034 3.1509
dipole: 3.1509
quadrupole: -72.6642 -140.0622 -160.1309
quadrupole: -38.2421 0.0450 0.0068
quadrupole: 51.6216 -15.7765 -35.8451 -38.2421 0.0450 0.0068
hfenergy: -1139.6920831 hartree
pointgroup: C01 [X(C20H16N4O2)]
dipole: -0.0000515 -0.0195419 -1.2395106 debye
polarizability: 766.1732319|-21.1766443|245.5723737|0.4996728|-2.3681712|105.5524693 unknown
InChI: InChI=1S/C20H16N4O2/c21-19(22)11-1-5-17-13(7-11)9-15(25-17)3-4-16-10-14-8-12(20(23)24)2-6-18(14)26-16/h1-10,21,23H,22,24H2
charge 0 multiplicity 1
42 atoms
O  2.41827 0.9455 0.025432
O  -2.41729 -0.944719 0.05583
N  8.855009 0.593311 -0.448996
N  -8.853603 -0.606487 -0.432939
N  8.265697 -1.553463 0.503845
N  -8.264233 1.57047 0.448817
C  4.160223 -0.5972 0.055969
C  -4.15893 0.598592 0.033499
C  3.816997 0.791139 0.030364
C  -3.816075 -0.789875 0.054728
C  1.875716 -0.382815 0.05017
C  -1.874517 0.383479 0.035927
C  2.906566 -1.320397 0.067942
C  -2.905023 1.321371 0.021335
C  5.52561 -0.963863 0.063726
C  -5.524142 0.965753 0.029179
C  6.507315 0.05423 0.042771
C  -6.506129 -0.052219 0.042407
C  0.445733 -0.525432 0.052652
C  -0.444697 0.526077 0.03375
C  4.762733 1.822371 0.0237
C  -4.762076 -1.820514 0.082892
C  6.120655 1.431297 0.030641
C  -6.119896 -1.429022 0.076523
C  7.951697 -0.356398 0.045543
C  -7.950367 0.358743 0.030755
H  2.773261 -2.400463 0.089445
H  -2.771048 2.401482 0.006723
H  5.859813 -2.004488 0.097934
H  -5.858094 2.00702 0.028242
H  0.066833 -1.553118 0.071511
H  -0.065858 1.553802 0.016499
H  4.464899 2.874093 0.028052
H  -4.464528 -2.871562 0.122929
H  6.885573 2.214146 0.079276
H  -6.885152 -2.209508 0.151418
H  9.854109 0.399475 -0.435968
H  8.537149 1.414043 -0.959524
H  -9.852641 -0.411978 -0.427136
H  -8.535517 -1.442837 -0.917276
H  9.281526 -1.770823 0.433303
H  -9.279869 1.785889 0.370012
