program: Gaussian 09
title: 000046340
version: EM64L-G09RevD.01
frameworkgroup: C1[X(C17H24N2O2S)]
method: RPBEPBE
basis: SDD
operation: Freq
keyword: #p
keyword: freq=noraman
keyword: PBEPBE/SDD
title: #p freq=noraman PBEPBE/SDD
converged: YES YES NO NO
title: Mulliken charges:
elementType: S O O N N C C C C C C C C C C C C C C C C C H H H H H H H H H H H H H H H H H H H H H H H H
charge: 0.256536 -0.204243 -0.224698 -0.456477 -0.394775 0.040187 -0.450005 -0.452867 -0.452869 -0.404291 -0.402841 -0.382834 -0.396616 -0.383258 0.249613 -0.434333 -0.175075 0.161986 0.163113 -0.268603 -0.138041 -0.510141 0.187964 0.186704 0.203791 0.196763 0.190620 0.201006 0.192145 0.190441 0.197016 0.196668 0.191849 0.199104 0.187644 0.211279 0.198797 0.184548 0.231583 0.223868 0.231418 0.333036 0.350966 0.261367 0.246471 0.265483
chargesum: 0.00000
title: Mulliken charges with hydrogens summed into heavy atoms:
elementType: S O O N N C C C C C C C C C C C C C C C C C
charge: 0.256536 -0.204243 -0.224698 -0.123441 -0.043809 0.228151 -0.059511 -0.065484 -0.059717 -0.016834 -0.014324 0.003913 0.013460 0.032873 0.249613 0.020952 -0.175075 0.161986 0.163113 -0.007236 0.108430 -0.244657
polarizability: 2.22287292e+02 -9.04079485e+00 2.16453528e+02 -1.58967480e+01 9.54507601e+00 1.92090917e+02
1716.lowfreq: -13.2763 -5.5340 -4.7356 -0.0019 -0.0005 0.0001 4.4237 8.4345 19.6273
frequency: -9.7636 7.4955 19.2357 38.6792 51.7956 57.6358 87.0588 92.5007 94.9695 132.0605 152.9026 158.7626 161.6003 195.6082 211.2257 233.7521 259.7636 305.4266 311.9055 321.1314 346.4457 375.7635 397.8598 430.3317 435.3120 456.1985 468.9170 483.8100 546.7551 547.9363 562.1585 595.0769 606.6498 626.0435 648.3240 687.1396 692.8980 699.7869 711.8943 728.5299 738.5992 763.6150 777.0813 785.4566 809.3348 830.8794 840.5352 844.0621 868.4538 888.8750 907.1956 908.4426 923.1065 953.9648 966.8560 984.3092 1015.5134 1030.9289 1041.6297 1050.0411 1051.5472 1058.9764 1068.0913 1077.9793 1090.8287 1097.6649 1103.8773 1114.3960 1137.3269 1159.9310 1182.1850 1190.3235 1194.1793 1224.4656 1235.4672 1245.3615 1253.0051 1256.3142 1270.0564 1278.7921 1289.6238 1298.8531 1303.3220 1310.5548 1311.2982 1319.0611 1332.2725 1334.2135 1336.6131 1338.5728 1340.4486 1348.6809 1354.4800 1359.6127 1363.1075 1451.4530 1455.3989 1458.0105 1459.7039 1461.6155 1465.0725 1466.9159 1473.5113 1475.7433 1482.3831 1547.9422 1685.9505 1724.1025 2928.9933 2944.1816 2949.5516 2956.7246 2957.6067 2962.2900 2963.5689 2964.0042 2964.7358 2989.2045 2991.8030 3011.0992 3015.8697 3022.5816 3025.0657 3026.4497 3035.9310 3039.1704 3057.8969 3171.6002 3188.7917 3238.2878 3585.0738 3604.0971
redmass: 3.0316 7.7315 4.5318 4.8238 7.1600 3.8424 2.5239 2.9129 4.1526 3.1185 5.6704 3.1082 4.6289 3.9675 1.7546 3.6428 5.2552 2.9553 1.9608 5.1322 5.6425 2.5935 7.2156 2.6038 2.2715 2.4498 1.6900 2.2270 3.5990 2.1318 3.0894 9.9229 8.5255 4.1044 1.2961 5.0263 5.3437 1.2805 3.3532 1.2376 3.6505 1.9613 1.4792 1.8601 4.2530 1.3986 1.8534 2.3529 2.3550 1.5148 1.8566 1.3894 1.6657 2.6459 3.4078 4.7905 1.7783 2.6322 2.0171 1.6874 1.4935 1.6097 1.8238 1.6402 1.4745 1.7156 2.0487 2.5131 2.9171 2.1623 1.8425 2.5815 2.6839 1.3843 1.4455 1.3663 1.2423 1.2875 1.3190 1.2670 1.1841 1.1378 1.9923 1.3375 1.4418 2.3188 1.4433 2.1018 1.5055 1.5755 1.5123 1.5650 1.5547 1.5532 1.6726 1.0852 1.0844 1.0909 1.0900 1.0772 1.0841 1.0858 1.0990 6.7477 1.1021 5.7787 8.6957 9.6554 1.0806 1.0593 1.0622 1.0620 1.0601 1.0629 1.0595 1.0631 1.0662 1.0646 1.0944 1.0977 1.0966 1.0990 1.0948 1.1014 1.1021 1.1036 1.1031 1.0899 1.0979 1.1003 1.0802 1.0798
irintensity: 0.0388 0.1533 0.3248 0.1852 0.0573 0.2264 0.4721 0.4767 0.3129 0.1306 2.0011 0.7556 0.8345 1.4113 0.0988 0.6861 1.3044 0.6314 0.1944 7.3083 1.1438 0.1019 11.9012 0.1281 0.6354 8.7378 90.2657 38.8876 1.7404 1.3124 1.4521 6.6611 5.4619 16.7096 142.5018 7.5606 7.8006 92.3691 36.5261 23.0353 22.0443 5.5633 0.7006 2.4337 12.5669 11.1799 3.6600 11.8260 2.6226 11.3486 1.4140 0.3269 5.5155 6.2221 13.2270 5.2752 5.6148 0.7380 18.4756 2.4346 0.6267 3.9466 1.6739 4.6118 2.5436 0.8683 0.4554 0.1044 3.7240 6.8621 10.0789 50.4215 21.8364 8.5343 40.3932 1.5638 4.9251 4.5761 5.3361 13.9054 2.8628 12.3178 130.4031 13.3772 7.2585 103.9415 2.1363 6.0040 5.1567 0.8624 0.5418 7.1918 0.8444 4.0939 10.0690 1.2773 7.0839 5.6463 8.4185 1.7757 11.1965 8.8303 2.5070 3.2799 15.1382 2.0238 516.4985 442.1947 6.2828 6.5493 22.8278 49.7070 17.5277 29.4977 54.8969 64.6126 11.9781 15.7664 10.2811 13.3250 72.5143 71.9922 49.0432 11.9197 27.9388 152.8445 65.6886 7.1953 1.8913 0.6336 76.9354 38.8609
temp: 298.150 k
press: 1.00000 atm
elementType: 16 8 8 7 7 6 6 6 6 6 6 6 6 6 6 6 6 6 6 6 6 6 1 1 1 1 1 1 1 1 1 1 1 1 1 1 1 1 1 1 1 1 1 1 1 1
symmnumber: 1
zpe: 1006682.0 jmol-1
zpe.correction: 0.383425 hartree
zpe.thermalcorrener: 0.404531 hartree
zpe.thermalcorrenthalpy: 0.405475 hartree
zpe.thermalcorrgfe: 0.330104 hartree
zpe.sumelectzpe: -1318.580164 hartree
zpe.sumelectthermal: -1318.559058 hartree
zpe.sumelectthermalent: -1318.558114 hartree
zpe.sumelectthermalfe: -1318.633485 hartree
dipole: -3.1098 2.1158 -0.2262
dipole: 3.7681
quadrupole: -150.3114 -137.9961 -148.5383
quadrupole: 10.3814 0.7400 -6.9768
quadrupole: -4.6962 7.6192 -2.9230 10.3814 0.7400 -6.9768
hfenergy: -1318.9635888 hartree
pointgroup: C01 [X(C17H24N2O2S1)]
dipole: 1.2393478 0.8122 0.0458215 debye
polarizability: 221.4320913|8.6088734|216.1541021|-17.0725029|-9.5921663|193.2455435 unknown
InChI: InChI=1S/C17H24N2O2S/c20-15-17(19-16(21)18-15,14-10-6-12-22-14)11-5-4-9-13-7-2-1-3-8-13/h6,10,12-13,18-19H,1-5,7-9,11H2
charge 0 multiplicity 1
46 atoms
S  -3.523954 1.672911 1.539591
O  -3.484343 -0.554391 -2.402652
O  -4.204683 -2.937719 1.602604
N  -2.696401 -1.185068 1.025157
N  -4.122767 -1.896355 -0.55105
C  4.17869 -0.458038 0.158181
C  4.559797 0.521767 -0.983332
C  5.229567 -0.375709 1.297379
C  2.750683 -0.205812 0.706972
C  5.998057 0.281216 -1.502793
C  6.669043 -0.619994 0.785653
C  7.033234 0.358784 -0.355771
C  1.612564 -0.499762 -0.2969
C  0.207724 -0.290023 0.313883
C  -2.355422 -0.36258 -0.15348
C  -0.913897 -0.64693 -0.683568
C  -2.597321 1.117839 0.083967
C  -3.383714 -0.913679 -1.209351
C  -3.719573 -2.09961 0.8093
C  -2.263593 2.191022 -0.728091
C  -2.710751 3.466103 -0.221391
C  -3.393328 3.372845 0.979724
H  4.211181 -1.491672 -0.255701
H  4.479213 1.561138 -0.597941
H  3.843124 0.435402 -1.822954
H  4.978149 -1.10731 2.091506
H  5.173839 0.63195 1.762318
H  2.675808 0.8481 1.050362
H  2.59954 -0.837565 1.607992
H  6.051745 -0.723085 -1.972635
H  6.244232 1.017113 -2.293081
H  7.391279 -0.522892 1.619697
H  6.750886 -1.661499 0.410395
H  8.049046 0.140761 -0.739265
H  7.055759 1.393802 0.044846
H  1.715152 0.150314 -1.188488
H  1.706493 -1.54533 -0.658214
H  0.117455 -0.920018 1.223548
H  0.100268 0.76351 0.638267
H  -0.852746 -1.721368 -0.946563
H  -0.785958 -0.082118 -1.626091
H  -2.201921 -1.141064 1.914347
H  -4.876902 -2.437247 -0.975183
H  -1.730651 2.075079 -1.674425
H  -2.532129 4.41469 -0.733447
H  -3.832272 4.162494 1.586876
