program: Gaussian 09
title: 000046302
version: EM64L-G09RevD.01
frameworkgroup: C1[X(C20H23ClN2)]
method: RPBEPBE
basis: SDD
operation: Freq
keyword: #p
keyword: freq=noraman
keyword: PBEPBE/SDD
title: #p freq=noraman PBEPBE/SDD
converged: YES YES NO NO
title: Mulliken charges:
elementType: Cl N N C C C C C C C C C C C C C C C C C C C C H H H H H H H H H H H H H H H H H H H H H H H
charge: -0.074073 -0.062909 -0.150464 -0.186530 -0.186029 -0.460603 -0.460212 -0.381125 -0.390466 -0.309285 -0.647180 0.575366 0.477883 -0.381164 -0.357885 -0.451027 -0.351873 -0.236184 -0.261674 -0.226571 -0.244203 -0.236124 -0.243784 0.231450 0.232120 0.220024 0.224127 0.226230 0.211924 0.233849 0.206361 0.209406 0.230589 0.229729 0.196663 0.226500 0.225825 0.269290 0.241771 0.238768 0.252741 0.230156 0.224920 0.223407 0.233455 0.226813
chargesum: 0.00000
title: Mulliken charges with hydrogens summed into heavy atoms:
elementType: Cl N N C C C C C C C C C C C C C C C C C C C C
charge: -0.074073 -0.062909 -0.150464 0.044921 0.046091 -0.016452 -0.022058 0.059085 0.049528 -0.079556 0.001808 0.575366 0.477883 -0.381164 -0.088595 -0.209256 -0.113105 0.016557 -0.031518 -0.001651 -0.020796 -0.002669 -0.016971
polarizability: 2.27863555e+02 -9.89907022e-01 2.37487396e+02 9.77917348e+00 -1.47942258e+01 2.12950305e+02
1716.lowfreq: -12.6401 -6.2573 -0.0011 0.0006 0.0015 6.3624 9.7897 42.0974 46.9880
frequency: -5.3822 42.0500 46.9742 50.1904 65.0823 69.2769 133.0744 153.4645 165.5175 177.2142 204.5481 209.7021 222.5707 239.7953 256.2874 282.0803 315.7939 343.9330 352.9595 365.9210 393.9139 401.5108 403.1433 452.1805 467.5686 495.0106 510.4715 543.9376 602.4665 614.6577 617.9349 639.7660 679.8087 700.5621 720.3141 727.0440 751.1679 759.4644 763.3345 779.6545 791.0097 817.2069 825.5293 832.0047 850.0276 859.8102 882.3173 909.1692 914.6791 923.8001 963.0977 967.5469 973.0188 985.3718 990.8955 993.3638 1002.7901 1008.9970 1011.8706 1019.8088 1027.2181 1037.3374 1051.5732 1064.0591 1079.5126 1094.9824 1113.1587 1122.4425 1129.8291 1138.1503 1147.9182 1168.4908 1171.1641 1182.3727 1185.5372 1188.3333 1196.6234 1205.1973 1210.5118 1231.3898 1245.3693 1258.4979 1267.1259 1277.7360 1280.7354 1306.4462 1308.4998 1315.7645 1336.6529 1342.7789 1345.3463 1370.1683 1382.6538 1389.8970 1424.2965 1428.0530 1441.4391 1450.7034 1454.2472 1458.8552 1462.1482 1470.5847 1476.3560 1480.1571 1482.0312 1572.4981 1593.8772 1602.9372 1610.7648 2882.4284 2885.3384 2890.9855 2899.2337 3001.5912 3015.4048 3021.9171 3038.0339 3043.9992 3051.0601 3059.1954 3063.7309 3076.2516 3086.8599 3121.2009 3127.4730 3129.0689 3140.1429 3142.2800 3149.9220 3156.2182 3163.5688 3173.1499
redmass: 4.3007 5.9344 3.6972 4.9253 4.9644 4.1621 5.4917 4.1945 4.1147 2.2996 1.3946 1.9903 3.7740 3.9453 3.5163 4.9987 3.0677 3.8534 2.1539 3.7404 2.0928 3.4730 5.5811 3.4483 4.1449 3.8681 3.5246 3.4255 5.5408 4.5364 4.4033 5.1605 6.4669 1.7492 3.4136 4.0551 4.3771 2.4326 1.2819 1.8598 3.9224 2.9156 2.7278 2.7964 1.2642 3.0887 1.4057 2.8601 1.8714 1.5272 1.3583 2.0220 1.3992 2.5639 4.8375 1.3969 1.3414 4.2994 2.0986 2.7290 2.1562 2.0423 1.6508 2.0363 1.6707 2.2527 1.5942 1.7352 1.9026 2.4278 1.1906 1.0646 1.0674 2.2808 1.5198 1.6196 2.0342 1.3396 1.5803 1.4454 1.7426 1.3999 1.2778 1.3819 1.4259 1.5469 1.4668 1.4065 1.3344 1.4473 1.5048 2.5911 3.6929 2.5363 2.1522 1.1676 2.0925 1.0823 2.4636 1.0812 1.0744 1.1024 1.0886 2.2200 1.0488 6.2618 6.0569 7.0361 6.1630 1.0812 1.0533 1.0699 1.0688 1.0607 1.0638 1.0761 1.0889 1.0875 1.0883 1.0899 1.1019 1.1005 1.1043 1.0844 1.0874 1.0858 1.0920 1.0903 1.0956 1.0950 1.1013 1.0990
irintensity: 0.0878 0.0504 0.0228 0.0355 0.8011 0.2450 3.9176 0.2785 0.9928 0.1573 0.2933 0.4384 0.7376 1.1504 0.5193 2.0572 0.1436 1.9641 1.4415 0.0953 3.1004 2.0559 4.4819 4.0517 1.6439 3.8549 2.2232 4.4000 8.1465 7.8681 10.3570 2.4800 30.2093 51.6018 10.7973 9.6406 0.7293 20.8667 79.7961 5.2989 6.7052 0.3980 28.9239 3.8918 0.1479 0.8925 0.5439 2.7679 3.1337 5.4599 2.7779 11.7804 0.2217 5.6320 0.2608 1.0717 9.2069 54.3562 7.4701 22.7812 6.8872 5.4226 2.5067 10.6513 16.2582 8.7463 0.7391 3.8328 7.3722 47.4194 8.3319 2.3362 0.5997 17.5060 6.7412 8.3028 0.5093 3.5220 7.5651 11.4480 2.3303 8.1733 9.6779 3.8631 3.0461 2.4500 1.2366 5.2601 0.9927 6.8146 14.3848 4.3190 3.3134 6.1329 21.3073 4.2641 9.1933 3.7607 34.1330 5.4518 13.2139 6.1321 32.5244 15.0508 4.1864 11.1589 0.7128 1.8270 3.7020 20.4486 100.6144 46.1654 103.2408 20.6384 49.7871 59.4992 8.3383 63.5822 46.1281 16.1271 3.1298 34.1141 79.8383 2.3870 0.8900 2.3562 23.9407 4.7278 28.5846 19.7854 21.7269 16.6970
temp: 298.150 k
press: 1.00000 atm
elementType: 17 7 7 6 6 6 6 6 6 6 6 6 6 6 6 6 6 6 6 6 6 6 6 1 1 1 1 1 1 1 1 1 1 1 1 1 1 1 1 1 1 1 1 1 1 1
symmnumber: 1
zpe: 1005725.3 jmol-1
zpe.correction: 0.383061 hartree
zpe.thermalcorrener: 0.402225 hartree
zpe.thermalcorrenthalpy: 0.403169 hartree
zpe.thermalcorrgfe: 0.335627 hartree
zpe.sumelectzpe: -1343.779438 hartree
zpe.sumelectthermal: -1343.760274 hartree
zpe.sumelectthermalent: -1343.759330 hartree
zpe.sumelectthermalfe: -1343.826872 hartree
dipole: 1.3210 -0.3339 1.8151
dipole: 2.2696
quadrupole: -138.3084 -133.2966 -141.2248
quadrupole: 0.4678 -0.6759 -3.6883
quadrupole: -0.6985 4.3133 -3.6148 0.4678 -0.6759 -3.6883
hfenergy: -1344.1624988 hartree
pointgroup: C01 [X(C20H23Cl1N2)]
dipole: 0.4671987 -0.0202673 -0.7606886 debye
polarizability: 226.1466676|-1.0206563|233.0208988|-12.1597466|-16.4685622|219.1336898 unknown
InChI: InChI=1S/C20H23ClN2/c1-22-16-11-12-17(22)14-23(13-16)20(15-7-3-2-4-8-15)18-9-5-6-10-19(18)21/h2-10,16-17,20H,11-14H2,1H3
charge 0 multiplicity 1
46 atoms
Cl -2.749856 1.623528 2.291349
N  3.765283 0.009027 0.803648
N  0.914175 0.004304 0.151481
C  3.107935 -1.170371 0.150859
C  3.140651 1.123665 0.019166
C  3.188801 -0.892144 -1.393706
C  3.222356 0.669501 -1.482672
C  1.641142 -1.205529 0.635207
C  1.673777 1.244391 0.489835
C  -0.49931 0.072277 0.635271
C  5.244527 -0.016094 0.752995
C  -1.263716 1.199896 -0.078862
C  -1.242078 -1.259126 0.424505
C  -2.305414 1.93185 0.534369
C  -0.984386 1.511264 -1.436592
C  -1.823188 -1.929288 1.527196
C  -1.372239 -1.827793 -0.868421
C  -3.050116 2.919608 -0.140434
C  -1.710012 2.494307 -2.138443
C  -2.521316 -3.145853 1.346265
C  -2.061858 -3.044858 -1.051709
C  -2.750455 3.200664 -1.491403
C  -2.642436 -3.708494 0.055952
H  3.611499 -2.105165 0.453267
H  3.665299 2.074647 0.217686
H  2.313054 -1.311171 -1.917125
H  4.099524 -1.343455 -1.827408
H  4.157207 1.030327 -1.948777
H  2.374605 1.065941 -2.066988
H  1.135286 -2.104795 0.244929
H  1.649311 -1.265977 1.75009
H  1.679374 1.431555 1.590722
H  1.188188 2.10584 -0.001919
H  -0.519599 0.288275 1.731267
H  5.679538 -0.089659 -0.272726
H  5.610114 -0.877957 1.339699
H  5.637089 0.902853 1.224289
H  -0.160954 0.965737 -1.911527
H  -1.732815 -1.495187 2.529644
H  -0.923672 -1.317712 -1.727673
H  -3.846744 3.456578 0.3827
H  -1.466456 2.710269 -3.184323
H  -2.968149 -3.651362 2.209825
H  -2.151687 -3.474962 -2.0559
H  -3.32377 3.966401 -2.024725
H  -3.183009 -4.651055 -0.086683
