program: Gaussian 09
title: 000046273
version: EM64L-G09RevD.01
frameworkgroup: C1[X(C12H19NO)]
method: RPBEPBE
basis: SDD
operation: Freq
keyword: #p
keyword: freq=noraman
keyword: PBEPBE/SDD
title: #p freq=noraman PBEPBE/SDD
converged: YES YES NO NO
title: Mulliken charges:
elementType: O N C C C C C C C C C C C C H H H H H H H H H H H H H H H H H H H
charge: -0.470120 -0.279979 -0.369520 -0.252225 -0.356021 -0.366488 -0.341713 0.428140 -0.690717 -0.442571 -0.388076 -0.219928 -0.225927 -0.241036 0.217986 0.203248 0.218980 0.199189 0.172178 0.178559 0.210125 0.269038 0.191891 0.191393 0.214245 0.210911 0.208947 0.236434 0.266058 0.345856 0.226449 0.225873 0.228823
chargesum: 0.00000
title: Mulliken charges with hydrogens summed into heavy atoms:
elementType: O N C C C C C C C C C C C C
charge: -0.124264 -0.010941 0.051714 -0.033246 0.015347 0.022195 0.041570 0.428140 -0.056615 -0.206136 -0.122018 0.006520 -0.000055 -0.012213
polarizability: 1.88388895e+02 1.27500021e+01 1.15920308e+02 -1.09382381e+01 1.25430682e+01 1.14774219e+02
1716.lowfreq: -9.4295 -5.2611 -0.0007 -0.0005 -0.0004 7.8471 22.5880 36.2196 42.4868
frequency: 21.3874 35.4284 42.4762 60.3145 92.5207 102.5993 131.0845 156.5606 191.1225 215.3728 230.4382 234.0308 297.8395 318.8690 355.0772 405.0218 414.1100 440.8763 517.4683 544.2507 615.8260 623.7765 707.2394 728.0304 737.3433 771.3590 800.1640 809.5439 857.5609 877.1723 893.9868 923.8899 933.6469 978.9618 988.9105 994.7579 996.4281 1016.7512 1025.1506 1037.7085 1052.5228 1080.9582 1082.0649 1123.8693 1143.9656 1155.2417 1171.4076 1180.9014 1193.6234 1205.0232 1222.9386 1250.5763 1272.1573 1277.7918 1282.3082 1285.0882 1311.4702 1336.3066 1339.5045 1357.0187 1385.8037 1386.8493 1392.5501 1440.0562 1451.9329 1464.6571 1467.6283 1473.6759 1476.6274 1480.8410 1485.5984 1495.3746 1593.4290 1612.6154 2838.1108 2864.8539 2958.2376 2967.1693 2971.2582 2972.3167 2984.4618 3006.4590 3015.9540 3039.1651 3069.5946 3070.9525 3115.0301 3125.1749 3137.8258 3149.5467 3163.5763 3438.2339 3569.1902
redmass: 3.1934 2.5179 4.1665 2.3647 2.7952 3.5008 2.0502 2.8139 3.6737 4.5226 1.2002 2.9111 2.3872 1.5346 2.6336 2.8388 4.1637 2.9388 3.4972 2.8257 6.4111 5.5915 1.7939 1.2613 1.0976 1.7979 1.1771 3.3764 1.2595 2.6526 1.8464 1.4110 1.2008 1.3893 6.0472 2.8682 1.3674 2.5677 2.1255 2.7478 1.9549 2.0972 1.6317 2.1849 1.5684 3.1411 1.0624 1.1171 1.5575 2.1974 1.3341 1.2482 1.2506 1.1412 1.1969 1.3896 1.2971 1.3571 1.3647 1.5774 1.5056 3.4711 1.4743 2.1477 1.2084 1.0847 1.0789 1.0697 1.0440 2.2924 1.0728 1.0926 6.1364 6.1322 1.0712 1.0702 1.0629 1.0617 1.0844 1.0363 1.0825 1.0983 1.0884 1.1020 1.1006 1.0995 1.0871 1.0863 1.0914 1.0956 1.1014 1.0738 1.0661
irintensity: 0.1567 0.5462 0.3289 0.3357 0.7979 0.1156 3.8508 1.3711 0.3710 0.2236 0.8540 5.3329 27.0902 92.1673 41.5615 0.4270 3.0293 0.8319 4.6895 36.7247 0.4227 12.9482 59.7883 51.4667 28.3185 66.2534 0.4705 15.4758 0.4126 17.6842 7.4264 6.5455 0.9351 0.1136 2.1070 34.0922 0.6936 6.3283 9.1017 32.4062 10.8076 5.8125 8.6492 3.9194 48.0969 43.0552 0.5935 1.5419 5.1802 5.1422 9.1474 8.3615 7.3668 2.2449 12.9231 20.7497 1.7300 3.3960 0.2028 8.1953 11.4058 1.1363 3.8080 11.9183 64.1799 10.3176 1.0810 3.3407 12.1097 8.2008 9.2638 8.2525 0.5821 2.2080 99.6112 102.8726 3.0235 53.9803 40.9154 38.8540 54.6390 1.9077 30.0044 48.8675 86.9381 58.4274 7.7422 0.1636 19.9465 31.4706 21.9789 2.8911 6.7715
temp: 298.150 k
press: 1.00000 atm
elementType: 8 7 6 6 6 6 6 6 6 6 6 6 6 6 1 1 1 1 1 1 1 1 1 1 1 1 1 1 1 1 1 1 1
symmnumber: 1
zpe: 750743.7 jmol-1
zpe.correction: 0.285943 hartree
zpe.thermalcorrener: 0.301369 hartree
zpe.thermalcorrenthalpy: 0.302314 hartree
zpe.thermalcorrgfe: 0.241103 hartree
zpe.sumelectzpe: -597.543156 hartree
zpe.sumelectthermal: -597.527730 hartree
zpe.sumelectthermalent: -597.526786 hartree
zpe.sumelectthermalfe: -597.587996 hartree
dipole: -1.2205 -0.1533 0.0088
dipole: 1.2301
quadrupole: -78.8888 -83.9443 -84.1559
quadrupole: 0.5877 1.7648 1.0683
quadrupole: 3.4408 -1.6146 -1.8262 0.5877 1.7648 1.0683
hfenergy: -597.8290994 hartree
pointgroup: C01 [X(C12H19N1O1)]
dipole: 0.4801082 -0.0608281 0.0037764 debye
polarizability: 188.5156312|-13.3456393|114.4556747|-9.6256186|-12.6155038|116.1121165 unknown
InChI: InChI=1S/C12H19NO/c1-2-3-9-13-10-12(14)11-7-5-4-6-8-11/h4-8,12-14H,2-3,9-10H2,1H3
charge 0 multiplicity 1
33 atoms
O  0.446515 1.968004 0.58877
N  -1.731738 0.183889 0.342436
C  -0.390563 -0.138335 -0.170989
C  0.683731 0.508753 0.720381
C  -2.847766 -0.382679 -0.442108
C  -4.209471 0.005677 0.166391
C  -5.407805 -0.557378 -0.630686
C  2.098328 0.123918 0.307964
C  -6.770379 -0.159813 -0.023077
C  2.812251 -0.862725 1.031929
C  2.708473 0.727599 -0.821726
C  4.110891 -1.250579 0.630306
C  4.007486 0.344105 -1.221909
C  4.711952 -0.647839 -0.498942
H  -0.248693 -1.236409 -0.157057
H  -0.217001 0.202742 -1.223191
H  0.492258 0.195146 1.768433
H  -2.746808 -1.487545 -0.439038
H  -2.824491 -0.065739 -1.5176
H  -4.289244 1.113009 0.209657
H  -4.246105 -0.354016 1.213242
H  -1.824183 1.202169 0.46773
H  -5.330096 -1.663072 -0.673853
H  -5.351869 -0.200089 -1.679403
H  -7.611627 -0.575512 -0.607838
H  -6.864483 -0.52985 1.0153
H  -6.886949 0.940221 0.002166
H  2.350551 -1.328568 1.911949
H  2.161607 1.50215 -1.370878
H  1.110988 2.450728 1.141902
H  4.653953 -2.014314 1.198427
H  4.471739 0.816287 -2.095358
H  5.720248 -0.944137 -0.809529
