program: LAMMPS
programVersion: 29 Sep 2021
lattice: 12.174243 0 0
lattice: 6.087121 10.543204 0
lattice: 0 0 50.398838
formula: Cu192O72
InChI: InChI=1S/192Cu.72O
264 atoms
Cu 12.8384 2.30089 29.7179
Cu 12.4951 6.27264 36.3310
Cu 8.73329 7.86789 34.3093
Cu 1.92273 2.91777 24.7454
Cu 6.5042 5.62137 24.5864
Cu 8.00019 4.52838 29.4427
Cu 15.9976 10.3336 36.4241
Cu 3.45338 0.260342 17.2565
Cu 0.399402 0.182364 17.2070
Cu 8.01551 9.95598 22.2330
Cu 11.0711 9.9593 22.2069
Cu 4.98727 6.4407 19.7264
Cu 8.01898 6.44292 19.7227
Cu 6.50034 9.06629 19.7155
Cu 9.50832 9.06659 19.7201
Cu 8.01283 6.26013 12.3874
Cu 9.55223 7.33734 22.1898
Cu 11.5646 1.8246 36.3225
Cu 8.04918 6.43502 27.0841
Cu 0.455007 0.328468 24.7483
Cu 11.9395 10.4236 32.2422
Cu 6.4940 7.37127 22.2230
Cu 11.0415 8.20713 17.2589
Cu 9.53957 5.3789 34.3330
Cu 9.51525 3.75759 27.0824
Cu 12.6500 3.91047 27.2588
Cu 13.0648 7.43535 29.8379
Cu 9.85515 6.7557 36.4254
Cu 11.0811 2.89614 24.7478
Cu 7.94717 1.0320 27.1746
Cu 15.9796 7.3511 29.6922
Cu 7.67583 8.97932 32.2590
Cu 7.85006 3.35078 34.3585
Cu 4.08376 4.88693 32.1892
Cu 4.6384 7.8551 36.3940
Cu 10.7414 4.31228 36.2822
Cu 6.14671 8.36242 34.3177
Cu 10.1502 1.0047 32.2334
Cu 8.23122 4.83911 36.4357
Cu 2.03032 1.24676 27.2632
Cu 4.95749 2.91885 24.5939
Cu 4.44215 6.34725 34.3795
Cu 4.75087 6.30603 12.3498
Cu 3.57719 1.83672 29.9123
Cu 1.92691 1.15436 19.7069
Cu 8.0287 4.69071 22.1741
Cu 4.97447 4.68817 22.1999
Cu 3.54735 5.60748 17.2276
Cu 6.49919 5.6041 17.1205
Cu 8.01136 2.94263 17.2850
Cu 1.81915 1.10971 12.5938
Cu 4.99964 2.94123 17.2499
Cu 2.29237 2.86958 31.6709
Cu 3.50661 1.94475 14.7928
Cu 6.56397 2.07457 14.7561
Cu 5.04189 4.6569 14.6710
Cu 7.9403 4.60485 14.6768
Cu 8.09008 10.0913 29.7578
Cu 6.69532 4.45259 32.3183
Cu 12.3829 3.68475 12.7906
Cu 3.34758 3.68089 12.5735
Cu 6.50624 1.84174 29.4975
Cu 6.53766 9.13238 27.1054
Cu 9.55149 9.04686 27.2295
Cu 4.96881 1.17552 19.7588
Cu 7.24851 7.37199 36.3095
Cu 3.45859 3.80492 19.7189
Cu 5.24913 1.14744 12.6051
Cu 12.6340 7.85956 32.4328
Cu 10.4794 9.84008 34.2451
Cu 3.41777 2.03656 22.2136
Cu 14.5284 9.80962 32.3612
Cu 3.42409 5.54969 24.6991
Cu 4.97548 1.10536 27.2464
Cu 11.2601 7.35118 34.3770
Cu 6.50656 2.04559 22.2017
Cu 6.49458 3.8427 19.7173
Cu 7.98847 8.17492 17.1079
Cu 6.42022 9.93742 36.3105
Cu 4.6816 0.818863 36.2864
Cu 3.47208 0.277723 24.7278
Cu 4.94955 8.22354 24.7184
Cu 17.1068 9.24144 32.3041
Cu 3.69926 1.69716 34.2367
Cu 11.8789 3.46858 32.0840
Cu 8.3726 1.36628 12.8340
Cu 10.9583 6.36275 12.5959
Cu 0.559324 0.708699 32.2230
Cu 10.1533 8.46368 32.2265
Cu 11.0923 9.96673 14.8077
Cu 8.06547 9.88885 14.7276
Cu 9.51106 7.38325 14.7304
Cu 6.45078 7.28661 14.4626
Cu 8.0499 8.23842 24.7170
Cu 4.9465 6.43361 27.1111
Cu 6.16459 1.33163 34.3275
Cu 9.24084 3.96667 32.2910
Cu 7.89316 10.3508 34.2625
Cu 6.13603 8.45134 38.1529
Cu 5.45409 5.39351 36.4647
Cu 3.2663 0.350202 32.0334
Cu 13.5408 5.36554 32.2495
Cu 4.83302 2.33123 32.0641
Cu 11.3078 0.249586 34.2983
Cu 11.7226 8.86992 36.4455
Cu 14.1973 10.0029 29.6537
Cu 12.5264 7.40801 14.7962
Cu 15.6428 7.38164 14.6729
Cu 14.1663 9.99218 14.7581
Cu 17.0466 9.91929 14.6754
Cu 5.15249 4.60091 29.4821
Cu 10.9526 9.92661 29.7691
Cu 6.34281 9.15433 12.3872
Cu 12.7081 9.31258 12.6067
Cu 8.4641 6.31811 32.2658
Cu 12.5508 8.95333 27.2644
Cu 15.6813 9.09423 27.2407
Cu 12.7554 2.2533 34.2243
Cu 14.1381 8.2066 17.2498
Cu 13.8730 6.89879 34.3770
Cu 13.8306 4.51894 10.8790
Cu 9.55553 0.272453 17.2841
Cu 6.47202 0.217979 24.6956
Cu 14.0792 6.42301 27.2438
Cu 14.2374 8.37773 36.3841
Cu 15.6253 7.31796 22.2049
Cu 13.9502 6.40067 12.5754
Cu 15.6684 9.05126 19.7137
Cu 12.5915 9.07262 19.7501
Cu 14.1210 6.43711 19.7086
Cu 11.0578 6.4406 19.7004
Cu 17.1499 9.94269 22.2310
Cu 14.1132 9.94563 22.2025
Cu 6.52583 0.307341 17.3127
Cu 5.01986 8.1710 17.1191
Cu 2.02601 1.35937 36.2532
Cu 5.25112 3.8663 34.2887
Cu 9.52989 0.241025 24.7198
Cu 11.0792 8.16926 24.7010
Cu 6.74838 7.33135 29.4575
Cu 3.72805 3.32245 36.2790
Cu 14.0798 8.15181 24.7261
Cu 11.0594 6.39705 27.2913
Cu 15.0821 5.89177 36.3805
Cu 9.02168 2.2617 36.3440
Cu 7.29618 0.305312 36.3772
Cu 2.67522 4.60305 34.3095
Cu 6.3577 2.7364 36.3975
Cu 5.71293 6.8043 32.3272
Cu 11.0249 5.88299 32.2295
Cu 9.51388 7.17405 29.5317
Cu 10.9828 4.47159 10.8984
Cu 12.3660 2.07764 10.8987
Cu 9.78016 2.26221 29.4992
Cu 17.2244 10.1300 29.7643
Cu 14.1882 4.72653 14.9920
Cu 10.9839 4.68081 15.0142
Cu 12.5468 1.97554 15.0120
Cu 9.57242 2.06079 14.7851
Cu 11.0594 4.78207 29.6719
Cu 11.0513 2.91676 17.3401
Cu 9.62934 3.52486 12.8603
Cu 1.96131 2.91368 17.3031
Cu 12.5937 5.58802 17.3060
Cu 9.44594 5.59876 17.2135
Cu 10.3498 2.8064 34.2901
Cu 11.0763 4.67359 22.1991
Cu 8.75286 0.746607 34.3653
Cu 7.00449 5.8451 34.3462
Cu 13.3146 3.83565 36.2790
Cu 12.5841 5.5274 24.7132
Cu 8.04839 2.90518 24.5786
Cu 14.1077 4.67156 22.2258
Cu 8.03905 1.17923 19.7668
Cu 11.0767 1.15758 19.7145
Cu 6.51156 3.72632 26.9179
Cu 3.50147 3.78631 27.2400
Cu 8.92425 9.45834 36.3912
Cu 7.73531 1.71329 32.3950
Cu 12.5935 7.29459 22.1932
Cu 13.0174 9.36944 34.3810
Cu 12.1038 4.86553 34.2380
Cu 9.54695 3.81495 19.7217
Cu 12.6007 3.79439 19.7488
Cu 10.8697 1.37884 12.8603
Cu 12.5849 2.0213 22.2424
Cu 15.7003 8.83365 34.3844
Cu 14.3145 4.77493 29.8189
Cu 11.0718 1.18479 27.1326
Cu 15.4332 7.26302 32.4220
Cu 9.59015 2.01378 22.2194
Cu 9.58164 5.56629 24.6509
O  6.49794 3.87832 17.8540
O  6.49782 3.80609 21.5784
O  3.41444 2.0224 24.0787
O  3.54599 2.06732 27.9699
O  14.1904 8.19043 31.2338
O  6.5370 3.59228 28.7507
O  9.39377 5.42688 30.2273
O  3.40342 5.53301 26.5668
O  10.1488 8.37815 37.3854
O  3.52571 1.84574 12.9253
O  9.56412 5.26928 11.9179
O  9.39127 5.59758 15.3532
O  6.47861 3.74544 13.9738
O  3.47913 2.03191 16.6613
O  3.43317 2.04871 20.3492
O  3.45248 5.56379 22.8311
O  3.47319 5.56169 19.0905
O  9.58724 5.5386 26.5140
O  11.2228 7.42347 30.9262
O  15.5818 9.0399 25.3772
O  6.48162 0.128903 30.2916
O  12.4496 7.47153 12.9287
O  12.3480 0.450096 11.9178
O  0.371978 0.137139 15.3471
O  15.5704 9.08183 13.9767
O  15.6997 9.03627 17.8505
O  12.7161 4.07271 29.1180
O  7.1708 7.41574 31.2282
O  9.59026 1.99027 24.0818
O  9.47617 1.97918 27.6811
O  12.5960 3.77445 21.6111
O  12.5893 7.34385 16.6648
O  6.50597 0.300659 19.1726
O  15.6354 9.07189 21.5781
O  12.5804 7.27234 24.0559
O  12.5738 7.23823 27.9965
O  3.78379 5.55114 30.2749
O  15.7993 9.14607 29.0972
O  6.5723 2.80934 31.3466
O  6.42329 0.138449 26.5591
O  0.490592 0.522105 30.2463
O  12.5889 7.30236 20.3294
O  6.51041 0.286828 22.8300
O  9.53983 9.09874 21.5844
O  6.39546 7.25575 12.5645
O  6.88299 0.504844 12.0795
O  9.60759 9.10808 14.0976
O  9.47819 9.03597 17.8590
O  6.50112 7.31466 16.3590
O  6.50325 7.31893 20.3591
O  0.412569 0.269855 19.0704
O  0.404843 0.270579 22.8831
O  6.55658 0.32082 15.4696
O  6.50219 7.41238 24.0833
O  6.4947 7.33795 27.6180
O  3.5948 5.6375 15.3688
O  12.6044 3.81325 14.6884
O  12.6009 3.80993 17.8938
O  9.53393 2.04176 16.7096
O  9.57286 2.05853 20.3561
O  9.53151 5.56752 19.0766
O  3.15777 5.38568 11.8041
O  9.55476 5.57256 22.7847
O  12.4058 3.69714 9.99455
O  2.28603 2.85181 33.5801
O  9.46806 9.02055 29.0857
O  10.2609 2.6389 31.2326
O  0.502946 0.388951 26.6164
O  6.69679 4.30372 37.4219
O  6.50725 3.82591 25.0706
O  12.5855 3.7922 25.3970
O  9.58948 9.07035 25.3643
initenergy: -1158.94179249389
energy: -1158.94459830474
