program: LAMMPS
programVersion: 29 Sep 2021
lattice: 12.174243 0 0
lattice: 6.087121 10.543204 0
lattice: 0 0 50.398838
formula: Cu192O72
InChI: InChI=1S/192Cu.72O
264 atoms
Cu 13.6091 8.6552 31.9397
Cu 12.7088 6.51273 34.2232
Cu 4.16685 2.29037 33.9337
Cu 10.1018 8.56836 24.6230
Cu 8.55776 0.665154 24.6415
Cu 16.0601 8.71683 31.9078
Cu 8.8760 4.14507 33.9374
Cu 11.5996 6.00482 17.1788
Cu 8.54322 5.96572 17.1266
Cu 10.0840 5.0643 22.1477
Cu 13.1222 5.0689 22.1655
Cu 7.05757 1.56162 19.6671
Cu 10.0846 1.54656 19.6876
Cu 8.56436 4.19415 19.6402
Cu 11.5969 4.20921 19.6599
Cu 9.9013 1.90414 12.1392
Cu 11.6060 2.42601 22.1497
Cu 12.8806 3.62719 32.0189
Cu 10.0748 1.55352 27.0324
Cu 8.57388 5.97722 24.6297
Cu 4.29486 5.74008 33.9526
Cu 8.56361 2.43483 22.1511
Cu 13.1339 3.34133 17.2151
Cu 7.43546 3.18834 31.7552
Cu 5.52665 9.4415 27.1484
Cu 8.59926 9.47522 27.0875
Cu 5.79703 5.9561 31.8292
Cu 5.56429 0.599102 34.8548
Cu 7.04446 8.57803 24.6330
Cu 4.00479 6.81882 27.1635
Cu 11.4988 0.813738 32.2325
Cu 7.35516 6.11488 33.8868
Cu 16.2644 10.0300 34.0232
Cu 8.18033 8.33688 34.1103
Cu 2.87698 4.91087 36.5755
Cu 11.4175 4.3169 34.0016
Cu 6.41756 2.6846 36.1400
Cu 8.91514 7.06691 36.3268
Cu 7.68339 0.658312 36.3527
Cu 10.1185 6.84576 27.1702
Cu 13.1384 8.57359 24.6512
Cu 11.5492 5.82504 31.9968
Cu 6.95807 1.28569 12.3667
Cu 10.1667 5.08475 29.5983
Cu 10.0580 6.83075 19.6374
Cu 16.1706 10.3348 22.1485
Cu 13.1291 10.3419 22.1427
Cu 5.50205 0.655074 17.1948
Cu 8.58696 0.627083 17.2023
Cu 16.2274 8.53258 17.0321
Cu 10.3284 6.61003 12.4274
Cu 13.1513 8.56688 17.1809
Cu 13.1380 10.3173 29.7647
Cu 11.7923 7.56012 14.6485
Cu 14.7207 7.62097 14.8495
Cu 13.0659 10.2791 14.7134
Cu 16.1149 10.3657 14.8380
Cu 14.7257 7.72703 29.7367
Cu 11.6595 7.77838 29.7559
Cu 15.2154 9.25991 12.4593
Cu 11.9312 9.12038 12.3595
Cu 16.1910 10.3242 29.6787
Cu 8.55484 4.22945 27.0425
Cu 11.6576 4.21435 27.1299
Cu 13.0953 6.85097 19.7110
Cu 10.0100 6.52243 34.0789
Cu 11.5960 9.47216 19.6692
Cu 13.7067 6.46045 12.5344
Cu 10.2033 1.97231 34.0485
Cu 4.0859 7.02211 36.0564
Cu 11.5935 7.70821 22.1536
Cu 14.2215 6.05616 32.2853
Cu 5.51308 0.633058 24.6346
Cu 13.1394 6.8275 27.1925
Cu 2.56748 0.781129 35.0616
Cu 14.6459 7.71064 22.1629
Cu 14.6855 9.42767 19.6462
Cu 10.0773 3.33032 17.1798
Cu 15.0289 9.13597 36.1619
Cu 10.1586 8.81945 37.6756
Cu 11.6147 5.93761 24.6405
Cu 7.03681 3.30771 24.6113
Cu 4.05248 3.35256 31.6191
Cu 11.3198 7.06775 36.2798
Cu 13.1943 5.13187 29.7401
Cu 8.54237 4.29392 12.4153
Cu 11.7759 3.3772 12.4981
Cu 8.73108 2.36615 29.4355
Cu 11.6777 2.45926 29.6328
Cu 13.2573 5.03722 14.8174
Cu 10.1021 5.13969 14.7000
Cu 11.5904 2.56338 14.9182
Cu 8.43527 2.42848 14.7296
Cu 10.0817 3.30651 24.6357
Cu 7.01389 1.52029 27.0681
Cu 14.9369 7.74334 33.9980
Cu 8.88569 5.6975 31.9980
Cu 5.49075 7.89043 33.8743
Cu 6.51932 7.05752 36.0190
Cu 5.33329 9.16646 36.0831
Cu 13.9391 4.36554 34.2584
Cu 4.04277 2.63714 36.4170
Cu 7.81583 9.24001 36.4174
Cu 0.429406 0.743372 36.4587
Cu 13.7885 9.95015 34.0790
Cu 4.02431 5.05939 29.6023
Cu 2.58819 2.25445 14.7907
Cu 5.52843 2.39188 14.6684
Cu 4.09496 4.82111 14.9397
Cu 7.01471 5.07487 14.6053
Cu 5.51006 2.31302 29.6443
Cu 2.41053 2.46012 29.5518
Cu 4.85844 5.75736 12.7779
Cu 2.7594 3.86224 12.5506
Cu 7.05406 5.02207 29.4679
Cu 2.49934 4.18908 27.0976
Cu 5.50083 4.13613 27.0923
Cu 13.8227 7.04559 36.3673
Cu 4.04237 3.32469 17.2258
Cu 6.20995 0.575956 32.3726
Cu 1.04666 1.38936 12.2528
Cu 5.55291 6.00329 17.0457
Cu 14.6478 5.96105 24.6550
Cu 4.00755 1.5036 27.1261
Cu 10.1526 0.705135 36.2621
Cu 5.51953 2.43532 22.1492
Cu 4.21591 1.10553 12.3958
Cu 5.53555 4.23503 19.6582
Cu 2.47259 4.18872 19.7259
Cu 4.00815 1.55316 19.6696
Cu 0.954896 1.53792 19.6831
Cu 7.03716 5.06761 22.1497
Cu 3.99351 5.07332 22.1629
Cu 14.6964 5.92689 17.3204
Cu 7.05198 3.32521 17.1946
Cu 11.7146 8.67624 33.5935
Cu 6.58898 10.1982 34.1141
Cu 5.51421 5.95085 24.6351
Cu 13.1226 3.30831 24.6371
Cu 10.3839 3.50614 31.9072
Cu 10.1115 9.15539 35.3330
Cu 3.99158 3.30888 24.6191
Cu 0.961052 1.53729 27.0953
Cu 1.65525 2.80146 36.3782
Cu 10.1098 4.93511 36.1128
Cu 2.71865 0.77448 37.5239
Cu 5.25716 4.85153 36.1718
Cu 5.38524 0.647554 37.3238
Cu 7.66251 4.87481 36.0499
Cu 7.6678 1.86178 34.0422
Cu 10.1165 10.3463 29.7480
Cu 17.2171 10.4984 11.2353
Cu 6.96866 9.27805 12.6850
Cu 5.57716 7.75861 29.6765
Cu 8.58762 7.72116 29.5266
Cu 10.0300 10.2738 14.6769
Cu 7.0781 10.4630 14.8534
Cu 8.51236 7.75662 14.6214
Cu 5.70225 7.59995 14.2788
Cu 7.03437 10.3856 29.5218
Cu 6.98366 8.54446 17.0316
Cu 5.13976 7.95406 11.8864
Cu 10.0467 8.58486 17.1254
Cu 2.44884 0.64528 17.2154
Cu 11.5800 0.682465 17.2287
Cu 7.2831 8.90734 31.7834
Cu 7.04793 10.3306 22.1386
Cu 12.5808 4.94359 36.2626
Cu 8.89833 2.78115 36.0812
Cu 11.3471 2.83686 36.1992
Cu 2.48127 0.66457 24.6164
Cu 16.1619 8.58523 24.6567
Cu 10.0880 10.3377 22.1331
Cu 4.01006 6.82996 19.7268
Cu 7.05072 6.81383 19.6401
Cu 14.6386 9.45411 27.1582
Cu 11.6081 9.4100 27.2057
Cu 12.5048 9.13307 36.1235
Cu 8.82674 0.447913 32.0909
Cu 2.47733 2.42413 22.1517
Cu 9.7297 8.06585 32.1030
Cu 9.99447 10.4201 33.1959
Cu 5.52872 9.43927 19.6843
Cu 8.5301 9.42367 19.6306
Cu 7.13788 6.75009 12.4766
Cu 8.5654 7.70368 22.1343
Cu 6.24023 3.91424 33.9935
Cu 12.6750 2.12227 34.1770
Cu 7.04486 6.84686 27.1325
Cu 1.85063 1.03236 32.4528
Cu 5.5291 7.70083 22.1699
Cu 11.6129 0.652475 24.6311
O  14.7254 9.38779 17.7808
O  14.6486 9.46131 21.5141
O  11.6273 7.69133 24.0162
O  11.6322 7.67616 27.8920
O  11.7391 7.82544 31.6009
O  14.6488 9.46938 29.0215
O  11.6267 0.69599 30.2630
O  5.50634 0.590159 26.5022
O  3.48972 4.04929 33.4940
O  12.0330 7.30885 12.7961
O  11.6214 1.77318 11.3276
O  11.5601 0.746899 15.3750
O  14.6366 9.39226 14.2332
O  11.6038 7.75224 16.5099
O  11.5572 7.72052 20.2912
O  5.51935 0.675403 22.7697
O  5.53584 0.684054 19.0533
O  11.6089 0.646312 26.4972
O  8.91612 9.91866 31.6441
O  5.51548 4.18738 25.2305
O  5.5584 0.635765 30.4958
O  2.68484 2.01744 12.9261
O  8.72059 6.0069 11.8125
O  8.52796 5.9912 15.2728
O  5.54656 4.12615 13.9694
O  5.55721 4.27597 17.7922
O  8.60363 9.51151 28.9357
O  5.6816 7.84243 31.5507
O  5.50929 7.71184 24.0322
O  5.52007 7.69408 27.8089
O  8.56892 9.45774 21.4981
O  2.49701 2.42997 16.6564
O  14.6374 5.96508 19.1703
O  5.51252 4.19352 21.5246
O  2.46759 2.42741 24.0138
O  2.49039 2.42109 27.6913
O  2.2921 2.63983 31.3694
O  5.50877 4.07751 28.9444
O  8.56898 5.93341 30.0843
O  14.6499 5.96439 26.5230
O  5.80883 4.07559 32.0102
O  2.48006 2.41564 20.2892
O  14.6441 5.9525 22.7902
O  11.6067 4.1850 21.5262
O  8.29429 2.48038 12.8657
O  15.2532 5.58983 12.0624
O  11.6822 4.28924 14.1620
O  11.5950 4.23941 17.7946
O  8.56071 2.39924 16.5944
O  8.5712 2.44731 20.2888
O  8.55747 5.93949 18.9878
O  8.56195 5.94743 22.7651
O  14.7989 5.85795 15.4845
O  8.56262 2.42151 24.0121
O  8.53821 2.44918 27.5948
O  5.45639 0.630191 15.3427
O  8.4663 9.50707 13.9911
O  8.48527 9.39845 17.7631
O  5.52526 7.69409 16.2265
O  5.55124 7.68905 20.3059
O  11.6031 0.654484 19.0843
O  5.64109 0.245815 11.6616
O  11.6115 0.664837 22.7673
O  16.1614 9.03299 10.8943
O  8.98036 2.26734 31.2513
O  11.7208 4.2287 28.9923
O  14.7465 5.97182 30.3865
O  8.5895 6.01031 26.4930
O  10.1804 10.4955 38.5177
O  14.6449 9.45969 25.2932
O  8.5784 9.44853 25.2270
O  11.6017 4.1841 25.2673
initenergy: -1158.59799508291
energy: -1158.61181356059
