program: LAMMPS
programVersion: 29 Sep 2021
lattice: 12.174243 0 0
lattice: 6.087121 10.543204 0
lattice: 0 0 50.398838
formula: Cu192O72
InChI: InChI=1S/192Cu.72O
264 atoms
Cu 15.2595 6.70004 34.5021
Cu 9.05912 1.40053 36.0252
Cu 7.50206 3.31395 34.7517
Cu 10.5610 3.32938 24.5287
Cu 15.1074 5.97888 24.6048
Cu 5.27702 2.15669 34.1722
Cu 9.50061 2.12626 33.6780
Cu 12.0625 0.719266 17.1843
Cu 8.96097 0.69163 17.1298
Cu 16.6285 10.3684 22.1027
Cu 7.49696 10.3710 22.1182
Cu 13.6001 6.87253 19.6105
Cu 4.45469 6.86943 19.6162
Cu 15.1116 9.49761 19.6159
Cu 5.95212 9.48504 19.6169
Cu 10.2342 4.93925 10.9066
Cu 5.97225 7.73891 22.1047
Cu 3.37152 0.695027 32.1813
Cu 4.44603 6.84503 27.0788
Cu 9.01765 0.685852 24.5786
Cu 7.62817 5.8411 33.8547
Cu 15.1134 7.74121 22.1140
Cu 7.49777 8.62422 17.1835
Cu 4.34366 1.35948 37.4529
Cu 5.9713 4.21019 27.0374
Cu 9.07676 4.26808 26.9446
Cu 8.9611 5.74286 31.6695
Cu 3.02845 1.45379 35.4086
Cu 7.4819 3.32907 24.5466
Cu 4.45717 1.57401 27.0955
Cu 6.66479 9.98655 36.4331
Cu 6.62941 1.31472 36.3184
Cu 11.3617 0.61876 32.3388
Cu 11.5878 9.7738 36.8984
Cu 9.07781 9.84947 36.8270
Cu 8.99004 7.7501 29.5788
Cu 9.14192 5.59018 35.9330
Cu 3.29127 3.87727 34.6851
Cu 6.69284 5.56763 36.1855
Cu 10.5527 1.5819 27.0162
Cu 13.5977 3.33805 24.5986
Cu 12.8264 7.3607 33.8296
Cu 4.74704 1.77081 12.7081
Cu 16.6581 10.3697 29.5436
Cu 10.5335 1.59332 19.6096
Cu 4.44983 5.09827 22.1008
Cu 13.5933 5.10011 22.1000
Cu 12.0746 5.99641 17.1139
Cu 15.1054 6.04872 16.9980
Cu 4.42909 3.37904 17.1868
Cu 5.24762 9.08774 12.6971
Cu 13.5903 3.40132 17.1417
Cu 13.5335 5.09812 29.6875
Cu 12.0902 2.36037 14.6796
Cu 3.03702 2.57986 14.6238
Cu 13.5585 5.08545 14.5885
Cu 4.36463 5.03315 14.6048
Cu 2.89206 2.44727 29.6079
Cu 12.0052 2.39241 29.5206
Cu 11.9453 4.03512 12.5038
Cu 10.3061 6.87375 12.5031
Cu 4.44483 5.06641 29.5187
Cu 15.1076 9.46429 27.0714
Cu 6.00418 9.47906 27.1419
Cu 1.39384 1.59818 19.6396
Cu 11.3700 1.12962 34.9378
Cu 12.0691 4.24286 19.6092
Cu 1.65526 1.53216 12.4753
Cu 13.5585 4.98161 33.6351
Cu 10.2379 7.81669 36.1297
Cu 12.0718 2.45746 22.1003
Cu 13.8643 9.64357 35.7509
Cu 12.0753 5.99082 24.5776
Cu 1.41667 1.58096 27.0786
Cu 7.38257 8.09968 32.5435
Cu 2.93085 2.45866 22.1116
Cu 2.92158 4.2753 19.6114
Cu 16.6088 8.61491 17.0312
Cu 4.56601 3.44223 31.9650
Cu 15.7566 10.0448 33.8720
Cu 12.0701 0.687142 24.6156
Cu 13.5891 8.60616 24.6094
Cu 15.1115 7.6688 36.8338
Cu 10.1547 3.42887 31.5683
Cu 7.53472 10.3723 29.6454
Cu 10.4648 1.30311 12.4678
Cu 7.1972 1.74106 12.7388
Cu 15.2046 7.74523 29.5905
Cu 11.3661 1.46391 37.3108
Cu 7.6662 10.4839 14.8047
Cu 16.6408 10.4195 14.8215
Cu 6.01116 7.74525 14.8217
Cu 15.0394 7.71152 14.3487
Cu 16.6286 8.6095 24.6224
Cu 13.5831 6.85085 27.0999
Cu 10.5595 8.6422 31.9157
Cu 13.7990 5.40222 36.2241
Cu 8.77914 9.59744 34.2322
Cu 16.3657 9.84974 36.4284
Cu 1.28756 1.21307 33.6453
Cu 7.45117 0.853738 34.0028
Cu 1.69658 1.40014 37.4758
Cu 11.2914 5.65538 37.2523
Cu 5.44259 7.76448 36.5133
Cu 13.1771 2.9536 35.4962
Cu 10.4994 10.3514 29.6136
Cu 8.93002 7.8327 14.6791
Cu 12.0240 7.74343 14.5883
Cu 10.6806 10.4270 14.6229
Cu 13.4689 10.3492 14.6041
Cu 12.0633 7.67095 29.7045
Cu 6.01873 7.69811 29.5946
Cu 9.0807 9.75672 12.4751
Cu 4.41523 6.74072 12.2544
Cu 13.5548 10.3380 29.4688
Cu 9.01981 9.4780 27.1040
Cu 12.0334 9.43587 27.1208
Cu 11.7443 3.26842 33.5930
Cu 10.5840 8.60677 17.1410
Cu 5.39781 3.41086 36.3526
Cu 7.20004 6.95674 12.4673
Cu 5.98411 0.685027 17.1867
Cu 2.93653 0.699202 24.6131
Cu 10.5459 6.86677 27.0687
Cu 8.79538 0.729112 31.8597
Cu 12.0677 7.74173 22.0990
Cu 13.2741 6.69426 12.3146
Cu 12.0986 9.46516 19.6107
Cu 9.01675 9.4810 19.6399
Cu 10.5573 6.86055 19.6094
Cu 7.49458 6.85613 19.6099
Cu 13.5806 10.3688 22.0986
Cu 10.5356 10.3720 22.1112
Cu 3.02084 0.768619 17.2042
Cu 13.6342 8.59628 16.9977
Cu 6.13161 0.797558 31.8524
Cu 6.15467 9.5259 34.0714
Cu 5.96987 0.68554 24.6186
Cu 7.4864 8.6254 24.6153
Cu 11.5046 5.69344 32.3580
Cu 9.83554 7.13741 33.8465
Cu 10.5462 8.6214 24.6042
Cu 7.4997 6.85449 27.0579
Cu 17.0628 8.57927 32.1257
Cu 13.5357 3.12184 31.7892
Cu 10.5570 3.45745 35.9741
Cu 12.6011 3.62369 37.7077
Cu 11.5256 9.43822 34.4557
Cu 9.63148 4.53771 33.7119
Cu 7.76096 7.81887 35.5147
Cu 10.6010 5.14323 29.6275
Cu 14.9729 9.54187 12.2548
Cu 7.40935 4.89204 10.9605
Cu 6.05714 2.54029 29.5438
Cu 9.05382 2.51754 29.3697
Cu 10.4807 5.07944 14.7401
Cu 7.44153 5.01112 14.7345
Cu 8.90194 2.48158 14.7350
Cu 5.95914 2.46992 14.6748
Cu 7.57753 5.09719 29.4886
Cu 7.46599 3.33583 17.1794
Cu 5.94671 3.90722 12.7389
Cu 10.5379 3.35513 17.1353
Cu 9.01867 5.98621 17.1349
Cu 5.92419 5.95232 17.1297
Cu 13.7890 8.77281 31.8919
Cu 7.49577 5.10307 22.0978
Cu 5.54697 7.14705 34.1597
Cu 8.11131 3.53236 37.0185
Cu 11.5551 5.57917 34.8918
Cu 9.01881 5.99967 24.5271
Cu 4.44004 3.33764 24.6155
Cu 10.5473 5.10455 22.0954
Cu 4.45039 1.58948 19.6633
Cu 7.49435 1.58374 19.6276
Cu 2.88775 4.22164 27.1135
Cu 12.0794 4.23224 27.0454
Cu 5.95325 5.97241 32.0285
Cu 2.96655 3.46421 37.0914
Cu 9.01781 7.74911 22.1003
Cu 15.3088 6.00393 31.9593
Cu 4.20084 5.58155 36.3363
Cu 5.96648 4.22978 19.6279
Cu 9.01996 4.2284 19.6194
Cu 8.7814 2.51608 10.9605
Cu 9.01971 2.46338 22.0958
Cu 5.48627 4.67796 34.1003
Cu 7.71493 3.6140 32.2460
Cu 7.4970 1.57113 27.0337
Cu 12.6337 7.57879 36.3875
Cu 5.96244 2.45529 22.1186
Cu 5.96536 5.98102 24.5826
O  2.9190 4.33074 17.7476
O  2.93374 4.21265 21.4760
O  12.0950 2.43513 23.9639
O  12.0631 2.47405 27.6594
O  11.8740 2.29982 31.3610
O  2.86026 4.21601 28.9789
O  6.01147 5.90412 30.0957
O  12.0664 5.99286 26.4432
O  2.85636 4.15511 32.3715
O  12.1060 2.18048 12.8145
O  5.93154 5.68172 11.8615
O  5.88845 5.91634 15.2749
O  2.86618 4.25804 13.8758
O  12.0800 2.47819 16.5475
O  12.0447 2.48721 20.2368
O  12.0720 5.98301 22.7142
O  12.0841 5.99716 18.9775
O  5.97175 5.97819 26.4462
O  4.06413 0.565738 33.9268
O  12.0709 9.47568 25.2542
O  12.0714 5.96264 30.4688
O  8.7801 7.93989 12.8142
O  8.72676 0.841451 11.8618
O  8.90834 0.68385 15.2751
O  12.0481 9.43999 13.8743
O  12.1401 9.44429 17.7469
O  9.12821 4.30241 28.7994
O  6.18027 2.63864 31.3928
O  5.94568 2.4384 23.9825
O  5.9872 2.45915 27.6833
O  9.02166 4.22483 21.4820
O  9.02968 7.76012 16.5467
O  2.92285 0.707339 19.0604
O  12.0556 9.49746 21.4757
O  9.01306 7.77526 23.9643
O  9.01811 7.71654 27.7146
O  8.96785 7.75395 31.4278
O  12.0003 9.40729 28.9860
O  9.00272 0.7438 29.9433
O  2.93808 0.690555 26.4806
O  12.1401 9.53492 32.4306
O  9.02479 7.71707 20.2368
O  2.93001 0.705043 22.7482
O  5.9786 9.49511 21.4821
O  14.9200 7.64427 12.4480
O  3.28167 0.925458 11.9055
O  6.09229 9.57534 14.3650
O  5.93541 9.48077 17.7570
O  15.1330 7.76327 16.2397
O  15.1144 7.74709 20.2491
O  9.01383 0.707992 18.9912
O  9.01691 0.70361 22.7153
O  3.13914 0.841244 15.3620
O  15.1122 7.73487 23.9771
O  15.1054 7.71705 27.7316
O  12.0424 5.98209 15.2620
O  8.97977 4.21275 14.1441
O  9.00562 4.2245 17.7580
O  5.93404 2.45203 16.6045
O  5.97977 2.47312 20.2556
O  5.96778 5.98358 18.9912
O  11.6918 5.7812 11.8266
O  5.97079 5.97975 22.7190
O  8.81718 4.1209 10.0822
O  15.3681 7.81707 31.4276
O  6.03329 9.47276 29.0177
O  2.92809 0.719971 30.3479
O  9.02483 0.678578 26.4403
O  14.4998 8.49637 34.1375
O  2.92835 4.2283 25.2467
O  9.02423 4.22294 25.0882
O  5.96761 9.48441 25.2742
initenergy: -1157.62798432942
energy: -1157.62798768644
