program: Gaussian 09
title: 000046336
version: EM64L-G09RevD.01
frameworkgroup: C1[X(C18H19N3O6)]
method: RPBEPBE
basis: SDD
operation: Freq
keyword: #p
keyword: freq=noraman
keyword: PBEPBE/SDD
title: #p freq=noraman PBEPBE/SDD
converged: YES YES NO NO
title: Mulliken charges:
elementType: O O O O O O N N N C C C C C C C C C C C C C C C C C C H H H H H H H H H H H H H H H H H H H
charge: -0.308244 -0.308313 -0.180297 -0.219702 -0.264266 -0.264266 0.125031 -0.455934 -0.455929 0.294096 -0.348180 -0.348039 -0.737469 0.268090 0.268066 0.484507 0.484505 -0.440969 -0.440964 -0.352939 -0.352932 -0.194318 -0.194319 -0.210424 -0.210438 -0.253707 -0.253707 0.262355 0.251492 0.251564 0.262294 0.237955 0.251009 0.251043 0.338147 0.338155 0.226319 0.226321 0.297110 0.297120 0.229571 0.229570 0.229031 0.229029 0.231490 0.231487
chargesum: 0.00000
title: Mulliken charges with hydrogens summed into heavy atoms:
elementType: O O O O O O N N N C C C C C C C C C C C C C C C C C C
charge: -0.308244 -0.308313 -0.180297 -0.219702 -0.264266 -0.264266 0.125031 -0.117787 -0.117774 0.294096 0.165668 0.165818 0.002538 0.268090 0.268066 0.484507 0.484505 -0.214649 -0.214643 -0.055830 -0.055812 0.035253 0.035251 0.018606 0.018590 -0.022217 -0.022221
polarizability: 3.20528914e+02 2.92927977e-03 2.34846510e+02 2.14054278e-03 1.93357439e+01 1.81542872e+02
1716.lowfreq: -0.0008 -0.0006 0.0004 2.0398 5.1970 7.4068 12.7318 17.0290 20.7787
frequency: 12.6012 16.9593 20.4585 28.0559 31.9370 33.3618 61.4263 70.0928 72.1187 82.3240 95.7347 104.9794 115.1181 159.2270 192.7568 208.8560 225.3141 248.2236 250.8453 259.9307 273.9864 302.7275 311.8364 330.0495 340.0855 368.0770 372.9350 408.2136 408.2190 448.3468 499.2661 509.0414 509.1346 510.8222 512.1428 598.2645 610.2710 615.2857 624.5377 650.0571 650.5007 664.3569 671.2825 693.6953 694.7716 698.2128 699.1648 705.9036 761.4930 767.8190 768.0615 823.5480 831.2947 836.2072 843.3092 843.3950 885.2352 904.9405 916.3363 916.8593 917.0828 965.0801 974.2705 974.2869 985.2823 985.4409 997.8201 997.8565 1001.1703 1014.8856 1025.6147 1031.9351 1045.3544 1091.5403 1092.0191 1147.4568 1150.4741 1157.1983 1168.8398 1174.2283 1174.2341 1192.2172 1192.2305 1204.5744 1231.4947 1255.3069 1257.5479 1257.6772 1320.5449 1327.3597 1328.0014 1355.4174 1374.8898 1387.0848 1387.3221 1399.8210 1418.6654 1433.8947 1436.7932 1438.3637 1454.2216 1458.2429 1483.9434 1487.3339 1487.3749 1517.1980 1522.4630 1603.7550 1603.9344 1617.6686 1618.2050 1681.2230 1684.1203 3016.5357 3017.9478 3024.9130 3101.4737 3106.9311 3117.2458 3117.2592 3117.7720 3125.3349 3135.4284 3135.4332 3147.6176 3147.6308 3167.5687 3167.5949 3190.3053 3190.3423 3536.0790 3536.1671
redmass: 6.4517 4.8009 5.1200 5.2103 6.9366 5.3450 11.8249 8.2964 7.5095 5.4732 6.5019 5.4421 6.0626 4.8000 3.9433 7.5568 1.5988 6.5805 3.3968 5.3132 2.6136 4.1990 3.0886 4.6344 5.5202 2.9867 3.8168 2.9157 2.9159 6.1439 4.5394 2.9808 2.8819 3.6340 5.0834 5.7897 6.1471 6.4681 5.8693 1.5405 1.5298 7.7018 7.0627 2.6197 2.4106 2.4013 2.6862 5.1528 11.9004 1.6555 1.6510 5.5195 3.2886 5.1909 1.2610 1.2613 6.6418 6.8829 1.6455 1.4265 1.6533 1.5938 1.3583 1.3583 6.1789 6.1860 1.3063 1.3060 3.8173 2.5568 2.6156 2.2529 4.7419 1.5581 1.5573 2.1954 3.5190 3.5336 2.3409 1.0509 1.0504 1.1131 1.1131 4.4272 5.1784 1.1581 2.1012 1.8745 1.4021 1.3826 1.3776 1.2896 1.3109 7.2504 5.2136 1.6682 2.8660 1.6526 2.3110 1.3380 1.1746 1.0545 1.0621 2.2371 2.2295 2.1582 2.1991 5.2158 5.1579 6.0487 6.0569 8.8717 8.9573 1.0372 1.0587 1.0585 1.1055 1.1049 1.0885 1.0885 1.1002 1.0999 1.0870 1.0870 1.0935 1.0935 1.0996 1.0995 1.0954 1.0954 1.0762 1.0762
irintensity: 0.1671 0.0240 0.5199 3.9699 0.1450 1.7513 1.6134 4.7818 2.0260 2.8200 1.9637 1.4132 0.1408 2.2487 2.8442 0.2147 2.7343 5.2200 2.1906 14.7145 0.0159 1.3866 7.8296 0.9526 0.3514 14.0543 41.5248 0.0063 0.0204 14.9758 2.5799 34.8839 15.9141 4.0187 0.2481 1.5692 1.3737 5.1028 1.4368 15.6060 19.8620 10.2447 29.8746 0.2797 0.0550 43.2962 121.1146 34.9609 27.7211 65.0631 157.0884 1.4585 6.2591 2.5304 0.3918 0.5952 84.6806 35.0077 1.9733 19.8094 31.2082 6.8438 0.0427 0.1165 6.8595 0.1313 0.6836 2.9389 463.0471 249.3695 32.9243 79.2573 97.2249 17.2191 50.8725 6.9011 441.6158 215.0463 3.1701 0.3114 0.4001 5.2414 4.2687 16.8649 36.0752 1.6816 9.6563 7.4004 6.5637 68.2486 15.4510 0.4012 30.7606 74.3376 0.8851 88.8594 74.9597 104.7283 41.2249 90.8352 12.8848 45.8334 30.1563 22.5332 12.9654 726.6183 290.3914 43.1063 12.4642 128.6094 48.8902 246.4001 263.7898 6.3265 34.0745 20.6355 3.5111 4.3679 8.4046 15.8130 3.8785 22.2740 0.8100 0.5514 3.2060 51.8483 31.6127 12.6237 5.8991 4.6356 6.2626 62.3361
temp: 298.150 k
press: 1.00000 atm
elementType: 8 8 8 8 8 8 7 7 7 6 6 6 6 6 6 6 6 6 6 6 6 6 6 6 6 6 6 1 1 1 1 1 1 1 1 1 1 1 1 1 1 1 1 1 1 1
symmnumber: 1
zpe: 925075.5 jmol-1
zpe.correction: 0.352343 hartree
zpe.thermalcorrener: 0.377686 hartree
zpe.thermalcorrenthalpy: 0.378630 hartree
zpe.thermalcorrgfe: 0.291552 hartree
zpe.sumelectzpe: -1310.899481 hartree
zpe.sumelectthermal: -1310.874138 hartree
zpe.sumelectthermalent: -1310.873194 hartree
zpe.sumelectthermalfe: -1310.960272 hartree
dipole: 0.0026 -0.7020 0.6817
dipole: 0.9785
quadrupole: -121.7788 -162.6394 -159.3102
quadrupole: 0.0041 -0.0006 -4.6586
quadrupole: 26.1307 -14.7299 -11.4007 0.0041 -0.0006 -4.6586
hfenergy: -1311.2518241 hartree
pointgroup: C01 [X(C18H19N3O6)]
dipole: -0.0011741 -0.1394513 0.3588237 debye
polarizability: 320.5288932|-0.0009641|203.4996132|0.0452205|32.5905948|212.8897888 unknown
InChI: InChI=1S/C18H19N3O6/c1-18(21(24)25,12-26-16(22)19-14-8-4-2-5-9-14)13-27-17(23)20-15-10-6-3-7-11-15/h2-11,19-20H,12-13H2,1H3
charge 0 multiplicity 1
46 atoms
O  -2.483927 -0.230981 -1.673171
O  2.485227 -0.230451 -1.669849
O  0.001831 -2.782916 -1.543944
O  0.002672 -1.736987 -3.564536
O  -2.880739 1.553957 -0.170505
O  2.881938 1.555175 -0.167957
N  0.001823 -1.734424 -2.276272
N  -4.320543 -0.324248 -0.36634
N  4.321332 -0.323479 -0.362291
C  0.000732 -0.319468 -1.582771
C  -1.248051 0.426293 -2.118238
C  1.249924 0.427098 -2.116115
C  -0.000318 -0.4892 -0.062847
C  -3.220491 0.450063 -0.659709
C  3.221666 0.451019 -0.656588
C  -5.353983 -0.050769 0.576793
C  5.354232 -0.049907 0.581389
C  -6.388976 -1.014807 0.702536
C  6.388986 -1.01408 0.708076
C  -5.377471 1.123784 1.372842
C  5.377389 1.124878 1.377098
C  -7.440339 -0.806809 1.617891
C  7.43979 -0.80598 1.624049
C  -6.438016 1.315428 2.284484
C  6.437374 1.316619 2.28937
C  -7.472062 0.360633 2.415795
C  7.471181 0.361694 2.421628
H  -1.267196 0.398511 -3.219236
H  -1.234859 1.466779 -1.745132
H  1.236052 1.467224 -1.742026
H  1.270476 0.400399 -3.217122
H  -0.001239 0.507312 0.410661
H  -0.889547 -1.045674 0.270879
H  0.88907 -1.044667 0.272123
H  -4.390171 -1.193417 -0.901311
H  4.391021 -1.192893 -0.89686
H  -6.370005 -1.9234 0.087224
H  6.370261 -1.92285 0.093018
H  -4.580634 1.863768 1.274338
H  4.580733 1.864962 1.27784
H  -8.233348 -1.557254 1.706847
H  8.232619 -1.556526 1.713742
H  -6.452438 2.223545 2.897347
H  6.451544 2.224913 2.901977
H  -8.288965 0.521897 3.126778
H  8.287648 0.523036 3.133095
