program: Orca
programVersion: 5.0.4
elementType: C C C C C O O O N N N O O O O O O H H H H H H H H H N O O O
charge: -1
multiplicity: 1
keywords: wB97X-D3BJ Opt Freq def2-TZVPP def2/J RIJCOSX VeryTightSCF
keywords: PAL8 TightOpt defgrid3
frequency: 0.00 0.00 0.00 0.00 0.00 0.00 19.88 29.40 34.82 35.53 41.75 49.63 52.07 62.35 68.44 75.73 88.00 89.63 103.37 107.34 111.90 195.69 205.34 255.26 286.69 294.10 310.01 346.05 387.04 414.99 446.38 461.56 552.07 630.72 685.20 692.94 696.38 697.71 700.48 730.46 735.66 787.14 807.73 808.16 811.27 874.02 911.69 917.24 932.65 942.12 953.61 966.13 1008.88 1027.69 1045.59 1058.50 1074.65 1119.43 1205.10 1234.96 1261.97 1308.97 1342.52 1367.27 1370.30 1382.82 1390.45 1412.89 1422.07 1423.87 1437.80 1460.53 1475.81 1497.45 1505.27 1516.80 1529.72 1537.60 1734.06 1744.59 1745.78 3079.41 3130.86 3145.02 3148.22 3150.59 3168.69 3200.73 3210.66 3215.36
frequency: 19.88 29.40 34.82 35.53 41.75 49.63 52.07 62.35 68.44 75.73 88.00 89.63 103.37 107.34 111.90 195.69 205.34 255.26 286.69 294.10 310.01 346.05 387.04 414.99 446.38 461.56 552.07 630.72 685.20 692.94 696.38 697.71 700.48 730.46 735.66 787.14 807.73 808.16 811.27 874.02 911.69 917.24 932.65 942.12 953.61 966.13 1008.88 1027.69 1045.59 1058.50 1074.65 1119.43 1205.10 1234.96 1261.97 1308.97 1342.52 1367.27 1370.30 1382.82 1390.45 1412.89 1422.07 1423.87 1437.80 1460.53 1475.81 1497.45 1505.27 1516.80 1529.72 1537.60 1734.06 1744.59 1745.78 3079.41 3130.86 3145.02 3148.22 3150.59 3168.69 3200.73 3210.66 3215.36
formula: C5H9N4O12
InChI: InChI=1S/C5H9N3O9.NO3/c1-5(2-15-6(9)10,3-16-7(11)12)4-17-8(13)14;2-1(3)4/h2-4H2,1H3;
30 atoms
C  2.179667 1.393683 -0.166628
C  1.544101 -0.004797 -0.108966
C  1.988006 -0.721374 -1.391607
C  2.172704 -0.668539 1.127875
C  0.020431 0.075583 0.003964
O  1.658928 2.155322 -1.289046
O  1.438124 -2.05902 -1.499502
O  1.548823 -1.943016 1.432528
N  0.650525 3.05112 -1.016021
N  0.327155 -2.206558 -2.294949
N  0.595213 -1.940259 2.421658
O  0.214139 3.573676 -2.002997
O  0.323258 3.234032 0.125921
O  -0.096578 -3.327516 -2.300003
O  -0.095668 -1.252486 -2.894877
O  0.092187 -3.016197 2.586362
O  0.364024 -0.91819 3.013202
H  3.24837 1.32018 -0.355877
H  2.017754 1.945586 0.753901
H  1.708733 -0.151255 -2.273242
H  3.0660 -0.876237 -1.369896
H  2.114384 -0.024317 1.999817
H  3.215955 -0.909946 0.940271
H  -0.271603 0.634992 0.891913
H  -0.408997 0.55567 -0.875595
H  -0.415297 -0.922814 0.070717
N  5.562833 0.40135 0.574642
O  5.000554 -0.179733 -0.395026
O  4.848427 0.962927 1.436051
O  6.790247 0.411765 0.663852
totalener: -1317.99753967 hartree
nucrepener: 1918.34426825 hartree
electener: -3236.34180792 hartree
oneelecener: -5640.08874472 hartree
twoeener: 2403.74693681 hartree
kineticenergy: 1313.46212115 hartree
exchangeener: -106.956104185098 hartree
correlationener: -7.203519708111 hartree
xcener: -114.159623893208 hartree
temp: 298.15 k
press: 1.00 atm
thermalcorrenthalpy: 0.00094421 hartree
totalenthalpy: -1317.82895684 hartree
totalentropycorr: -0.07221741 hartree
gibbsenthalpy: -1317.90117425 hartree
gibbsminuselec: 0.15172913 hartree
chargesum: -1.0000000
charge: -0.165255 0.327097 -0.168457 -0.152550 -0.477936 -0.159786 -0.145206 -0.148490 0.490618 0.486846 0.490485 -0.293787 -0.303073 -0.288515 -0.309568 -0.292083 -0.309986 0.166356 0.147172 0.144312 0.180199 0.150543 0.152901 0.134865 0.118839 0.108020 0.498227 -0.498783 -0.471644 -0.411361
charge: -0.053098 -0.183552 -0.064319 -0.057764 0.008060 0.201862 0.207710 0.206973 -0.154946 -0.155532 -0.155460 -0.017720 -0.011065 -0.014397 -0.017628 -0.017765 -0.017037 0.023978 0.012700 0.005388 0.027903 0.011938 0.025088 0.018121 0.014071 0.011974 -0.257666 -0.227273 -0.207513 -0.163032
qa: -0.1653 0.3271 -0.1685 -0.1526 -0.4779 -0.1598 -0.1452 -0.1485 0.4906 0.4868 0.4905 -0.2938 -0.3031 -0.2885 -0.3096 -0.2921 -0.3100 0.1664 0.1472 0.1443 0.1802 0.1505 0.1529 0.1349 0.1188 0.1080 0.4982 -0.4988 -0.4716 -0.4114
va: 3.8940 3.5672 3.8488 3.9029 4.0188 2.0514 2.0603 2.0600 4.5654 4.5701 4.5632 2.0150 1.9876 2.0219 1.9760 2.0172 1.9768 1.0654 1.0078 1.0214 1.0249 1.0097 1.0613 1.0021 0.9980 0.9927 4.6372 1.6623 1.7522 1.8559
dispcorr: -0.055401915 hartree
energy: -1318.052964569964
dipole: -1.57511 -1.48992 -3.06503 2.66177 -2.69791 -0.03614 0.56837 -1.16688 -0.59851
quadrupole: 2381.68965 -2523.76334 -0.95655 -0.20701 -0.20533 2238.55974 -2351.92696 -0.12743 0.93022 -0.34416 1630.29736 -1736.93724 -0.26 0.30 0.91 372.85831 -380.04169 2 3 6 406.75234 -415.32550 2 0 1 -257.12709 258.22830 5 4 8
magnitude: 3.12313 au
magnitude: 7.93836 debye
zeropoint: 0.20161601 hartree
thermalvibcorrection: 0.01856814 hartree
thermalrotcorrection: 0.00141627 hartree
thermaltrasncorrection: 0.00141627 hartree
thermaltotal: -1317.82994787 hartree
thermalcorr: 0.02140069 hartree
nonthermalcorr: 0.20161601 hartree
totalcorr: 0.22301670 hartree
totalenthalpy: -1317.82900366 hartree
