program: Orca
programVersion: 5.0.4
elementType: C C C C C O O O N N N O O O O O O H H H H H H H H H N O O O
charge: -1
multiplicity: 1
keywords: wB97X-D3BJ Opt Freq def2-TZVPP def2/J RIJCOSX VeryTightSCF
keywords: PAL8 TightOpt defgrid3
frequency: 0.00 0.00 0.00 0.00 0.00 0.00 16.86 26.20 28.48 30.32 42.78 46.11 61.49 64.96 69.98 70.98 78.86 96.87 112.13 126.41 135.68 190.04 215.01 240.71 245.39 272.58 286.32 318.11 379.53 415.47 422.23 466.00 522.76 637.00 663.31 688.71 695.04 702.47 731.73 735.59 739.60 808.05 810.11 811.30 833.69 874.33 911.05 927.08 944.29 964.57 967.05 977.04 1013.59 1036.18 1055.38 1057.46 1079.39 1121.38 1196.32 1240.22 1273.78 1308.65 1334.57 1359.28 1368.84 1384.44 1393.48 1411.92 1428.43 1431.18 1441.29 1464.46 1492.60 1506.83 1511.09 1518.65 1526.21 1528.21 1737.79 1740.37 1757.35 3058.93 3101.43 3111.59 3121.72 3133.89 3157.46 3160.27 3193.35 3201.27
frequency: 16.86 26.20 28.48 30.32 42.78 46.11 61.49 64.96 69.98 70.98 78.86 96.87 112.13 126.41 135.68 190.04 215.01 240.71 245.39 272.58 286.32 318.11 379.53 415.47 422.23 466.00 522.76 637.00 663.31 688.71 695.04 702.47 731.73 735.59 739.60 808.05 810.11 811.30 833.69 874.33 911.05 927.08 944.29 964.57 967.05 977.04 1013.59 1036.18 1055.38 1057.46 1079.39 1121.38 1196.32 1240.22 1273.78 1308.65 1334.57 1359.28 1368.84 1384.44 1393.48 1411.92 1428.43 1431.18 1441.29 1464.46 1492.60 1506.83 1511.09 1518.65 1526.21 1528.21 1737.79 1740.37 1757.35 3058.93 3101.43 3111.59 3121.72 3133.89 3157.46 3160.27 3193.35 3201.27
formula: C5H9N4O12
InChI: InChI=1S/C5H9N3O9.NO3/c1-5(2-15-6(9)10,3-16-7(11)12)4-17-8(13)14;2-1(3)4/h2-4H2,1H3;
30 atoms
C  2.083678 1.507182 -0.000981
C  1.547891 0.07175 -0.06486
C  1.974509 -0.65371 -1.337368
C  1.952768 -0.641067 1.231192
C  0.010672 0.084142 -0.059943
O  1.499977 2.328327 -1.051268
O  3.417151 -0.6667 -1.405445
O  3.387579 -0.743891 1.421851
N  2.266408 2.571956 -2.16505
N  3.926139 -1.173636 -2.577023
N  3.975026 -1.919431 1.024741
O  1.682166 3.202782 -3.001782
O  3.396032 2.161831 -2.201109
O  5.120749 -1.184273 -2.610505
O  3.146063 -1.54283 -3.417213
O  5.159314 -1.932399 1.190685
O  3.27918 -2.79776 0.579016
H  3.16692 1.548371 -0.068352
H  1.737768 1.972623 0.922721
H  1.613435 -1.682271 -1.335614
H  1.583413 -0.142521 -2.21745
H  1.511206 -1.632526 1.283404
H  1.617223 -0.045442 2.080369
H  -0.35259 0.499274 0.881658
H  -0.371994 0.673545 -0.893605
H  -0.376341 -0.934429 -0.148179
N  0.058808 1.597723 3.545891
O  -0.452744 2.251768 4.455808
O  -0.443729 0.510084 3.176698
O  1.099996 2.012204 2.972083
totalener: -1317.99732141 hartree
nucrepener: 1937.21102783 hartree
electener: -3255.20834923 hartree
oneelecener: -5677.73922309 hartree
twoeener: 2422.53087386 hartree
kineticenergy: 1313.45905560 hartree
exchangeener: -106.955871388379 hartree
correlationener: -7.203300981459 hartree
xcener: -114.159172369838 hartree
temp: 298.15 k
press: 1.00 atm
thermalcorrenthalpy: 0.00094421 hartree
totalenthalpy: -1317.82848897 hartree
totalentropycorr: -0.07255961 hartree
gibbsenthalpy: -1317.90104858 hartree
gibbsminuselec: 0.15122501 hartree
chargesum: -1.0000000
charge: -0.149769 0.228520 -0.217741 -0.132527 -0.329805 -0.157004 -0.148345 -0.153368 0.485390 0.500603 0.507218 -0.292546 -0.303524 -0.281225 -0.315565 -0.282986 -0.329860 0.151047 0.194068 0.144959 0.143324 0.133315 0.169115 0.147826 0.089095 0.075438 0.507337 -0.416696 -0.478448 -0.487845
charge: -0.051304 -0.188870 -0.096443 -0.059479 0.040344 0.204396 0.208136 0.206220 -0.159909 -0.149487 -0.157538 -0.020647 -0.013226 -0.000235 -0.020581 -0.005102 -0.031130 0.006379 0.022431 0.019603 0.015449 0.010154 0.024992 0.025273 0.009424 0.013421 -0.257385 -0.169018 -0.210365 -0.215502
qa: -0.1498 0.2285 -0.2177 -0.1325 -0.3298 -0.1570 -0.1483 -0.1534 0.4854 0.5006 0.5072 -0.2925 -0.3035 -0.2812 -0.3156 -0.2830 -0.3299 0.1510 0.1941 0.1450 0.1433 0.1333 0.1691 0.1478 0.0891 0.0754 0.5073 -0.4167 -0.4784 -0.4878
va: 3.7774 3.7476 3.9535 3.8297 3.8907 2.0520 2.0356 2.0630 4.5684 4.5638 4.5660 2.0135 1.9842 2.0369 1.9874 2.0340 1.9594 1.0200 1.0517 0.9996 0.9903 1.0110 1.0902 1.0618 1.0152 1.0062 4.6276 1.8457 1.7347 1.6978
dispcorr: -0.055020800 hartree
energy: -1318.053084527937
dipole: -9.86044 10.97113 1.11069 -1.80797 0.20231 -1.60566 0.55445 -3.83868 -3.28423
quadrupole: 1593.82272 -1711.77913 -0.54322 .32084 .77587 1753.70335 -1862.84390 -0.38909 0.72268 -0.57126 2976.52280 -3118.42219 0.74 0.61 0.26 -951.48782 967.42308 3 2 7 -1128.31449 1155.25122 9 2 7 185.57705 -197.86677 9 1 4
magnitude: 3.82072 au
magnitude: 9.71151 debye
zeropoint: 0.20130684 hartree
thermalvibcorrection: 0.01866933 hartree
thermalrotcorrection: 0.00141627 hartree
thermaltrasncorrection: 0.00141627 hartree
thermaltotal: -1317.83027581 hartree
thermalcorr: 0.02150188 hartree
nonthermalcorr: 0.20130684 hartree
totalcorr: 0.22280872 hartree
totalenthalpy: -1317.82933160 hartree
