program: Orca
programVersion: 5.0.4
elementType: C C C C C O O O N N N O O O O O O H H H H H H H H H N O O O
charge: -1
multiplicity: 1
keywords: wB97X-D3BJ Opt Freq def2-TZVPP def2/J RIJCOSX VeryTightSCF
keywords: PAL8 TightOpt defgrid3
frequency: 0.00 0.00 0.00 0.00 0.00 0.00 19.46 27.01 35.25 43.56 47.06 52.05 59.73 66.79 68.62 76.30 79.19 91.91 103.79 113.98 119.00 185.53 196.14 245.61 268.69 274.67 288.00 373.17 384.57 415.92 450.36 462.85 521.45 649.70 660.34 695.41 696.96 698.66 718.71 732.10 735.43 784.73 806.05 809.52 811.00 874.49 902.79 921.93 932.10 955.70 962.00 972.85 1006.26 1026.73 1051.35 1057.83 1065.65 1120.94 1217.14 1243.14 1258.05 1317.18 1358.01 1362.42 1371.55 1383.88 1390.56 1412.27 1423.71 1432.07 1442.30 1459.13 1493.39 1496.23 1507.80 1516.80 1526.30 1530.59 1735.27 1742.47 1758.57 3067.07 3113.04 3121.73 3127.42 3146.26 3156.95 3191.46 3198.99 3204.29
frequency: 19.46 27.01 35.25 43.56 47.06 52.05 59.73 66.79 68.62 76.30 79.19 91.91 103.79 113.98 119.00 185.53 196.14 245.61 268.69 274.67 288.00 373.17 384.57 415.92 450.36 462.85 521.45 649.70 660.34 695.41 696.96 698.66 718.71 732.10 735.43 784.73 806.05 809.52 811.00 874.49 902.79 921.93 932.10 955.70 962.00 972.85 1006.26 1026.73 1051.35 1057.83 1065.65 1120.94 1217.14 1243.14 1258.05 1317.18 1358.01 1362.42 1371.55 1383.88 1390.56 1412.27 1423.71 1432.07 1442.30 1459.13 1493.39 1496.23 1507.80 1516.80 1526.30 1530.59 1735.27 1742.47 1758.57 3067.07 3113.04 3121.73 3127.42 3146.26 3156.95 3191.46 3198.99 3204.29
formula: C5H9N4O12
InChI: InChI=1S/C5H9N3O9.NO3/c1-5(2-15-6(9)10,3-16-7(11)12)4-17-8(13)14;2-1(3)4/h2-4H2,1H3;
30 atoms
C  2.15344 1.490512 0.093719
C  1.59195 0.063674 0.043991
C  2.038982 -0.525231 -1.300625
C  2.10074 -0.83324 1.176222
C  0.059497 0.100403 0.013098
O  1.711337 2.233118 1.258974
O  3.492115 -0.608102 -1.405636
O  1.590353 -0.413674 2.466106
N  2.565667 2.253722 2.335128
N  4.068874 -1.825296 -1.148553
N  0.530655 -1.136823 2.978811
O  2.13126 2.86697 3.266099
O  3.628672 1.694202 2.245686
O  5.264539 -1.805194 -1.230967
O  3.362824 -2.764349 -0.880637
O  0.095869 -0.662088 3.986945
O  0.175636 -2.133292 2.40915
H  1.747625 2.054292 -0.746918
H  3.239367 1.502919 0.053151
H  1.608696 -1.508445 -1.468172
H  1.751448 0.149309 -2.107249
H  3.180328 -0.756973 1.299539
H  1.822821 -1.868735 1.005795
H  -0.349245 -0.911848 0.004821
H  -0.327934 0.626034 0.887071
H  -0.277044 0.609964 -0.890976
N  0.259031 1.847839 -3.510493
O  1.268289 2.223146 -2.856358
O  -0.241608 0.727038 -3.25904
O  -0.221626 2.573109 -4.382411
totalener: -1317.99620619 hartree
nucrepener: 1923.20381611 hartree
electener: -3241.20002230 hartree
oneelecener: -5649.63069290 hartree
twoeener: 2408.43067060 hartree
kineticenergy: 1313.45743139 hartree
exchangeener: -106.955257658248 hartree
correlationener: -7.203404442072 hartree
xcener: -114.158662100320 hartree
temp: 298.15 k
press: 1.00 atm
thermalcorrenthalpy: 0.00094421 hartree
totalenthalpy: -1317.82764019 hartree
totalentropycorr: -0.07209257 hartree
gibbsenthalpy: -1317.89973276 hartree
gibbsminuselec: 0.15173019 hartree
chargesum: -1.0000000
charge: -0.150162 0.288761 -0.151755 -0.246139 -0.373082 -0.154855 -0.154447 -0.165533 0.508069 0.488919 0.486896 -0.286858 -0.322442 -0.289310 -0.315097 -0.278774 -0.299265 0.178838 0.141390 0.142871 0.169221 0.154466 0.171963 0.095059 0.096900 0.140266 0.506773 -0.489150 -0.477057 -0.416463
charge: -0.062385 -0.191366 -0.044976 -0.082457 0.031461 0.204012 0.204035 0.199279 -0.156136 -0.157806 -0.151262 -0.008324 -0.023787 -0.014963 -0.021970 -0.003448 -0.008593 0.024107 0.005576 0.011630 0.022422 0.020611 0.007699 0.014100 0.009902 0.026291 -0.257822 -0.217027 -0.209758 -0.169043
qa: -0.1502 0.2888 -0.1518 -0.2461 -0.3731 -0.1549 -0.1544 -0.1655 0.5081 0.4889 0.4869 -0.2869 -0.3224 -0.2893 -0.3151 -0.2788 -0.2993 0.1788 0.1414 0.1429 0.1692 0.1545 0.1720 0.0951 0.0969 0.1403 0.5068 -0.4891 -0.4771 -0.4165
va: 3.8183 3.6439 3.8342 3.9248 3.9225 2.0575 2.0554 2.0384 4.5664 4.5613 4.5801 2.0294 1.9670 2.0201 1.9700 2.0361 1.9962 1.0630 1.0209 1.0032 1.0960 0.9913 1.0098 1.0061 1.0076 1.0573 4.6329 1.6983 1.7366 1.8458
dispcorr: -0.055256751 hartree
energy: -1318.051462936993
dipole: -3.48019 4.99317 1.51298 -2.27567 0.26931 -2.00636 -2.72420 5.78615 3.06194
quadrupole: 1373.79700 -1484.53123 .30637 -0.32669 .89410 1685.31954 -1796.23127 -0.65923 0.60476 0.44686 3295.61348 -3441.16412 0.68 0.72 0.03 -403.67323 411.66985 6 6 0 112.34366 -124.42169 7 3 0 -297.51772 310.70697 0 2 8
magnitude: 3.96107 au
magnitude: 10.06824 debye
zeropoint: 0.20144914 hartree
thermalvibcorrection: 0.01859648 hartree
thermalrotcorrection: 0.00141627 hartree
thermaltrasncorrection: 0.00141627 hartree
thermaltotal: -1317.82858478 hartree
thermalcorr: 0.02142903 hartree
nonthermalcorr: 0.20144914 hartree
totalcorr: 0.22287816 hartree
totalenthalpy: -1317.82764057 hartree
