program: Orca
programVersion: 5.0.4
elementType: C C C C C O O O N N N O O O O O O H H H H H H H H H N O O O
charge: -1
multiplicity: 1
keywords: wB97X-D3BJ Opt Freq def2-TZVPP def2/J RIJCOSX VeryTightSCF
keywords: PAL8 TightOpt defgrid3
frequency: 0.00 0.00 0.00 0.00 0.00 0.00 2.71 24.81 32.59 38.90 41.01 44.51 53.23 62.78 64.34 69.78 75.94 95.36 110.59 120.07 140.23 177.31 210.96 238.01 242.46 289.64 296.70 312.50 357.21 426.07 443.73 503.25 516.17 634.53 666.79 687.60 698.27 700.73 731.81 736.92 751.95 799.79 808.37 811.53 813.26 874.09 917.17 931.19 952.90 957.34 964.98 975.84 1013.98 1026.21 1051.13 1054.27 1073.92 1121.57 1229.33 1240.85 1249.73 1323.47 1336.14 1371.27 1374.89 1377.51 1389.63 1411.52 1419.00 1440.42 1445.52 1466.37 1507.61 1513.01 1514.98 1524.43 1528.15 1530.12 1740.16 1744.57 1746.14 3073.66 3082.76 3104.15 3113.75 3142.77 3168.93 3176.88 3197.83 3203.32
frequency: 2.71 24.81 32.59 38.90 41.01 44.51 53.23 62.78 64.34 69.78 75.94 95.36 110.59 120.07 140.23 177.31 210.96 238.01 242.46 289.64 296.70 312.50 357.21 426.07 443.73 503.25 516.17 634.53 666.79 687.60 698.27 700.73 731.81 736.92 751.95 799.79 808.37 811.53 813.26 874.09 917.17 931.19 952.90 957.34 964.98 975.84 1013.98 1026.21 1051.13 1054.27 1073.92 1121.57 1229.33 1240.85 1249.73 1323.47 1336.14 1371.27 1374.89 1377.51 1389.63 1411.52 1419.00 1440.42 1445.52 1466.37 1507.61 1513.01 1514.98 1524.43 1528.15 1530.12 1740.16 1744.57 1746.14 3073.66 3082.76 3104.15 3113.75 3142.77 3168.93 3176.88 3197.83 3203.32
formula: C5H9N4O12
InChI: InChI=1S/C5H9N3O9.NO3/c1-5(2-15-6(9)10,3-16-7(11)12)4-17-8(13)14;2-1(3)4/h2-4H2,1H3;
30 atoms
C  2.051612 1.37535 0.102565
C  1.487517 -0.046818 0.035869
C  2.077496 -0.718177 -1.210545
C  2.045003 -0.796048 1.253748
C  -0.0433 -0.04145 0.019054
O  1.50216 2.08402 -1.040135
O  1.650297 -2.103034 -1.308639
O  1.508245 -0.253313 2.489571
N  1.849121 3.409169 -1.10732
N  0.592621 -2.367728 -2.148611
N  0.454465 -0.930115 3.056815
O  1.432038 3.958475 -2.089539
O  2.495624 3.872526 -0.207674
O  0.244732 -3.51439 -2.110059
O  0.143455 -1.478937 -2.821724
O  -0.00368 -0.363435 4.009423
O  0.110197 -1.981486 2.585468
H  3.139694 1.364181 0.034919
H  1.728231 1.871198 1.017088
H  1.796424 -0.187872 -2.115046
H  3.165382 -0.763019 -1.14291
H  3.122583 -0.633441 1.336505
H  1.817035 -1.856174 1.198843
H  -0.431035 0.503865 0.882435
H  -0.41751 0.44418 -0.880782
H  -0.439143 -1.056997 0.060149
N  5.666051 0.231103 0.070008
O  6.894792 0.19143 0.022256
O  4.990918 0.388537 -0.980045
O  5.064781 0.117174 1.166483
totalener: -1318.00140332 hartree
nucrepener: 1892.43946384 hartree
electener: -3210.44086716 hartree
oneelecener: -5588.11461929 hartree
twoeener: 2377.67375213 hartree
kineticenergy: 1313.46064272 hartree
exchangeener: -106.957265515174 hartree
correlationener: -7.202268657343 hartree
xcener: -114.159534172517 hartree
temp: 298.15 k
press: 1.00 atm
thermalcorrenthalpy: 0.00094421 hartree
totalenthalpy: -1317.83219377 hartree
totalentropycorr: -0.07072680 hartree
gibbsenthalpy: -1317.90292056 hartree
gibbsminuselec: 0.15229064 hartree
chargesum: -1.0000000
charge: -0.151400 0.303167 -0.176264 -0.171746 -0.422268 -0.156568 -0.158579 -0.156475 0.483492 0.489002 0.490082 -0.304277 -0.298781 -0.292475 -0.302777 -0.293516 -0.305158 0.174700 0.130640 0.149156 0.167973 0.186130 0.148372 0.091108 0.122172 0.116824 0.508328 -0.410189 -0.486085 -0.474588
charge: -0.062272 -0.188923 -0.052860 -0.053439 0.011927 0.201007 0.201145 0.205627 -0.151180 -0.155073 -0.155605 -0.026180 -0.004241 -0.017395 -0.011071 -0.019399 -0.013411 0.018782 0.014076 0.009101 0.019925 0.015245 0.004319 0.014016 0.016401 0.013302 -0.256006 -0.162188 -0.210085 -0.205544
qa: -0.1514 0.3032 -0.1763 -0.1717 -0.4223 -0.1566 -0.1586 -0.1565 0.4835 0.4890 0.4901 -0.3043 -0.2988 -0.2925 -0.3028 -0.2935 -0.3052 0.1747 0.1306 0.1492 0.1680 0.1861 0.1484 0.0911 0.1222 0.1168 0.5083 -0.4102 -0.4861 -0.4746
va: 3.8368 3.6244 3.8215 3.7652 3.9833 2.0492 2.0491 2.0512 4.5861 4.5688 4.5702 2.0050 2.0061 2.0167 1.9868 2.0141 1.9881 1.0601 1.0110 1.0190 1.0769 1.0767 1.0205 1.0039 1.0105 0.9969 4.6224 1.8509 1.7132 1.7299
dispcorr: -0.054112925 hartree
energy: -1318.055772557135
dipole: -4.40340 0.88350 -3.51990 -0.72702 0.35366 -0.37336 0.45904 -0.46987 -0.01083
quadrupole: 2264.19001 -2402.40672 -0.96007 -0.27976 .00112 2223.51711 -2335.24091 0.16110 -0.54957 0.81977 1940.53147 -2051.48258 -0.22 0.78 0.57 567.79746 -576.23081 8 7 2 -102.13016 101.51930 7 2 6 -161.24308 163.45861 3 2 9
magnitude: 3.53967 au
magnitude: 8.99712 debye
zeropoint: 0.20147182 hartree
thermalvibcorrection: 0.01871228 hartree
thermalrotcorrection: 0.00141627 hartree
thermaltrasncorrection: 0.00141627 hartree
thermaltotal: -1317.83275592 hartree
thermalcorr: 0.02154482 hartree
nonthermalcorr: 0.20147182 hartree
totalcorr: 0.22301664 hartree
totalenthalpy: -1317.83181171 hartree
