program: Orca
programVersion: 5.0.4
elementType: C C C C C O O O N N N O O O O O O H H H H H H H H H
charge: 0
multiplicity: 1
keywords: wB97X-D3BJ Opt Freq def2-TZVPP def2/J RIJCOSX VeryTightSCF
keywords: PAL8 TightOpt defgrid3
frequency: 0.00 0.00 0.00 0.00 0.00 0.00 12.23 32.74 39.45 49.85 59.60 69.71 75.29 92.57 95.53 192.38 202.65 255.76 283.62 286.66 309.53 329.78 390.55 422.43 446.18 453.61 550.67 629.23 675.53 680.24 681.36 686.93 697.48 783.67 798.26 799.10 802.47 890.86 894.53 913.40 929.53 947.27 958.86 1016.85 1041.16 1064.95 1086.84 1095.96 1205.72 1240.85 1269.07 1315.87 1340.68 1366.22 1368.69 1377.60 1394.70 1422.33 1426.13 1436.71 1459.72 1483.85 1490.32 1500.36 1512.45 1533.60 1771.48 1782.10 1784.60 3084.50 3092.20 3095.81 3102.66 3159.36 3164.39 3169.57 3174.75 3185.81
frequency: 12.23 32.74 39.45 49.85 59.60 69.71 75.29 92.57 95.53 192.38 202.65 255.76 283.62 286.66 309.53 329.78 390.55 422.43 446.18 453.61 550.67 629.23 675.53 680.24 681.36 686.93 697.48 783.67 798.26 799.10 802.47 890.86 894.53 913.40 929.53 947.27 958.86 1016.85 1041.16 1064.95 1086.84 1095.96 1205.72 1240.85 1269.07 1315.87 1340.68 1366.22 1368.69 1377.60 1394.70 1422.33 1426.13 1436.71 1459.72 1483.85 1490.32 1500.36 1512.45 1533.60 1771.48 1782.10 1784.60 3084.50 3092.20 3095.81 3102.66 3159.36 3164.39 3169.57 3174.75 3185.81
formula: C5H9N3O9
InChI: InChI=1S/C5H9N3O9/c1-5(2-15-6(9)10,3-16-7(11)12)4-17-8(13)14/h2-4H2,1H3
26 atoms
C  2.145419 1.398498 -0.124048
C  1.520438 -0.004269 -0.121831
C  1.939944 -0.6831 -1.432366
C  2.150479 -0.705926 1.093776
C  -0.001339 0.076299 0.008213
O  1.733551 2.163551 -1.267093
O  1.500185 -2.047087 -1.512457
O  1.529358 -1.961612 1.398127
N  0.722804 3.11154 -1.042046
N  0.35312 -2.278691 -2.277662
N  0.606255 -1.944619 2.450276
O  0.3675 3.633794 -2.050229
O  0.355237 3.291343 0.083995
O  0.024233 -3.422648 -2.262673
O  -0.149651 -1.348558 -2.845044
O  0.084546 -3.002301 2.607991
O  0.450319 -0.920308 3.056489
H  3.232694 1.346907 -0.218166
H  1.893515 1.935577 0.787784
H  1.574549 -0.125833 -2.291096
H  3.028076 -0.756658 -1.492311
H  2.107092 -0.065369 1.97296
H  3.192121 -0.966025 0.89634
H  -0.286162 0.610707 0.914247
H  -0.435864 0.584169 -0.852566
H  -0.438079 -0.922057 0.048313
totalener: -1037.43018193 hartree
nucrepener: 1383.41703176 hartree
electener: -2420.84721369 hartree
oneelecener: -4167.20116852 hartree
twoeener: 1746.35395484 hartree
kineticenergy: 1033.69854741 hartree
exchangeener: -84.939209955261 hartree
correlationener: -5.772548709415 hartree
xcener: -90.711758664675 hartree
temp: 298.15 k
press: 1.00 atm
thermalcorrenthalpy: 0.00094421 hartree
totalenthalpy: -1037.27474835 hartree
totalentropycorr: -0.06057926 hartree
gibbsenthalpy: -1037.33532761 hartree
gibbsminuselec: 0.14236619 hartree
chargesum: -0.0000000
charge: -0.176867 0.276329 -0.128896 -0.159183 -0.460830 -0.169224 -0.155005 -0.152552 0.501266 0.496020 0.501640 -0.250975 -0.282139 -0.252435 -0.290334 -0.248878 -0.294116 0.134156 0.156271 0.162523 0.119786 0.151972 0.127101 0.141167 0.129624 0.123580
charge: -0.080973 -0.192769 -0.087937 -0.083384 0.020197 0.193032 0.198668 0.201461 -0.145000 -0.147222 -0.145770 0.028194 0.009681 0.025195 0.002164 0.028419 -0.000033 0.027559 0.013575 0.011704 0.024826 0.010860 0.026413 0.022485 0.020676 0.017980
qa: -0.1769 0.2763 -0.1289 -0.1592 -0.4608 -0.1692 -0.1550 -0.1526 0.5013 0.4960 0.5016 -0.2510 -0.2821 -0.2524 -0.2903 -0.2489 -0.2941 0.1342 0.1563 0.1625 0.1198 0.1520 0.1271 0.1412 0.1296 0.1236
va: 3.9901 3.5698 3.9199 3.9725 4.0202 2.0464 2.0569 2.0575 4.5424 4.5467 4.5362 2.0667 2.0134 2.0663 1.9985 2.0692 1.9968 1.0006 1.0052 1.0183 1.0061 1.0064 1.0065 0.9992 0.9968 0.9914
dispcorr: -0.047313837 hartree
energy: -1037.479912072647
dipole: 5.52877 -3.69841 1.83036 3.86349 -3.10419 0.75930 1.88907 -1.57153 0.31754
quadrupole: 344.91354 -412.82823 .02453 -0.93365 .35735 2246.15661 -2334.04903 -0.08240 0.35435 0.93147 1526.78908 -1607.09127 0.99 0.05 0.06 119.32608 -118.50800 6 2 8 51.34459 -50.67022 3 3 2 -340.05286 343.48704 0 0 4
magnitude: 2.00688 au
magnitude: 5.10109 debye
zeropoint: 0.18552798 hartree
thermalvibcorrection: 0.01362225 hartree
thermalrotcorrection: 0.00141627 hartree
thermaltrasncorrection: 0.00141627 hartree
thermaltotal: -1037.27792930 hartree
thermalcorr: 0.01645479 hartree
nonthermalcorr: 0.18552798 hartree
totalcorr: 0.20198277 hartree
totalenthalpy: -1037.27698509 hartree
