program: Orca
programVersion: 5.0.4
elementType: C C C C C O O O N N N O O O O O O H H H H H H H H H
charge: 0
multiplicity: 1
keywords: wB97X-D3BJ Opt Freq def2-TZVPP def2/J RIJCOSX VeryTightSCF
keywords: PAL8 TightOpt defgrid3
frequency: 0.00 0.00 0.00 0.00 0.00 0.00 23.28 31.09 37.63 61.30 64.94 71.32 90.76 114.25 123.15 186.35 210.84 223.46 236.74 270.72 284.44 311.55 375.87 415.52 422.26 460.89 519.19 634.57 656.00 676.72 682.71 691.57 734.53 798.48 800.21 804.01 829.03 890.54 905.24 933.89 941.06 950.70 965.15 1006.92 1049.76 1069.30 1080.77 1096.51 1197.74 1238.41 1269.75 1304.88 1332.76 1356.51 1367.41 1379.62 1386.80 1421.26 1427.05 1435.54 1453.76 1486.44 1491.00 1510.41 1513.94 1523.93 1774.87 1776.86 1791.79 3070.22 3096.38 3103.84 3111.21 3140.75 3153.87 3166.11 3175.74 3195.87
frequency: 23.28 31.09 37.63 61.30 64.94 71.32 90.76 114.25 123.15 186.35 210.84 223.46 236.74 270.72 284.44 311.55 375.87 415.52 422.26 460.89 519.19 634.57 656.00 676.72 682.71 691.57 734.53 798.48 800.21 804.01 829.03 890.54 905.24 933.89 941.06 950.70 965.15 1006.92 1049.76 1069.30 1080.77 1096.51 1197.74 1238.41 1269.75 1304.88 1332.76 1356.51 1367.41 1379.62 1386.80 1421.26 1427.05 1435.54 1453.76 1486.44 1491.00 1510.41 1513.94 1523.93 1774.87 1776.86 1791.79 3070.22 3096.38 3103.84 3111.21 3140.75 3153.87 3166.11 3175.74 3195.87
formula: C5H9N3O9
InChI: InChI=1S/C5H9N3O9/c1-5(2-15-6(9)10,3-16-7(11)12)4-17-8(13)14/h2-4H2,1H3
26 atoms
C  2.134973 1.468157 -0.018171
C  1.535702 0.056968 -0.083391
C  1.951324 -0.671231 -1.361028
C  1.932929 -0.699823 1.190242
C  0.002364 0.12318 -0.079586
O  1.515115 2.351841 -0.971711
O  3.384295 -0.740237 -1.381877
O  3.343602 -0.696525 1.452165
N  2.230773 2.607254 -2.145618
N  3.917078 -1.203942 -2.582834
N  4.035708 -1.864062 1.100145
O  1.642054 3.335907 -2.881655
O  3.304538 2.091733 -2.279831
O  5.106053 -1.250964 -2.572828
O  3.142017 -1.493531 -3.452228
O  5.207421 -1.758799 1.26281
O  3.397567 -2.801988 0.709214
H  3.211993 1.458359 -0.160671
H  1.902229 1.925526 0.944633
H  1.538332 -1.681424 -1.382618
H  1.598737 -0.131916 -2.240101
H  1.563823 -1.722802 1.161874
H  1.506735 -0.19576 2.059372
H  -0.356307 0.664262 0.798369
H  -0.367772 0.639456 -0.964281
H  -0.42694 -0.880742 -0.060504
totalener: -1037.43530372 hartree
nucrepener: 1425.73857039 hartree
electener: -2463.17387411 hartree
oneelecener: -4252.12345069 hartree
twoeener: 1788.94957658 hartree
kineticenergy: 1033.70376090 hartree
exchangeener: -84.940685319183 hartree
correlationener: -5.772889703288 hartree
xcener: -90.713575022471 hartree
temp: 298.15 k
press: 1.00 atm
thermalcorrenthalpy: 0.00094421 hartree
totalenthalpy: -1037.28114848 hartree
totalentropycorr: -0.05832830 hartree
gibbsenthalpy: -1037.33947678 hartree
gibbsminuselec: 0.14355034 hartree
chargesum: -0.0000000
charge: -0.126278 0.202916 -0.202577 -0.148471 -0.312044 -0.168047 -0.168944 -0.171841 0.497104 0.504558 0.519334 -0.254914 -0.285164 -0.257241 -0.294135 -0.245454 -0.301627 0.172519 0.130640 0.148805 0.153708 0.147294 0.132343 0.102159 0.117251 0.108105
charge: -0.076026 -0.192867 -0.100705 -0.086784 0.038578 0.193267 0.195485 0.191235 -0.150390 -0.143578 -0.147906 0.020692 0.007015 0.025931 0.001376 0.035828 -0.003752 0.013849 0.028215 0.024164 0.018139 0.013316 0.028513 0.022785 0.021873 0.021751
qa: -0.1263 0.2029 -0.2026 -0.1485 -0.3120 -0.1680 -0.1689 -0.1718 0.4971 0.5046 0.5193 -0.2549 -0.2852 -0.2572 -0.2941 -0.2455 -0.3016 0.1725 0.1306 0.1488 0.1537 0.1473 0.1323 0.1022 0.1173 0.1081
va: 3.8864 3.7382 3.9740 3.9534 3.9222 2.0456 2.0218 2.0485 4.5431 4.5463 4.5478 2.0619 2.0022 2.0653 2.0105 2.0797 1.9983 1.0144 1.0027 0.9963 0.9870 1.0118 1.0030 1.0070 1.0145 1.0028
dispcorr: -0.047596081 hartree
energy: -1037.485144487193
dipole: -14.35293 12.33116 -2.02177 0.67490 -0.52180 0.15309 7.27663 -5.76386 1.51276
quadrupole: 898.15382 -973.24099 -0.54683 .70812 -0.44670 1456.54907 -1535.35902 -0.01095 -0.53954 -0.84189 1236.23887 -1311.42511 0.83 0.45 -0.30 -581.08406 586.93182 7 5 2 -11.79069 8.07249 1 4 7 -489.89462 493.65379 7 8 9
magnitude: 2.52971 au
magnitude: 6.43001 debye
zeropoint: 0.18541538 hartree
thermalvibcorrection: 0.01365322 hartree
thermalrotcorrection: 0.00141627 hartree
thermaltrasncorrection: 0.00141627 hartree
thermaltotal: -1037.28324335 hartree
thermalcorr: 0.01648576 hartree
nonthermalcorr: 0.18541538 hartree
totalcorr: 0.20190114 hartree
totalenthalpy: -1037.28229914 hartree
