program: Orca
programVersion: 5.0.4
elementType: O O O O O O O O N N N N N C C C C C C C H H H H H O O O N
charge: -1
multiplicity: 1
keywords: wB97X-D3BJ Opt Freq def2-TZVPP def2/J RIJCOSX VeryTightSCF
keywords: PAL8 TightOpt defgrid3
frequency: 0.00 0.00 0.00 0.00 0.00 0.00 22.10 39.49 41.12 47.80 50.59 54.06 66.90 70.00 77.29 94.11 109.52 121.00 145.26 157.71 173.26 181.90 194.81 203.88 214.26 265.43 333.33 341.12 358.77 362.92 376.56 386.55 463.51 480.48 536.19 558.09 600.64 640.97 692.39 728.13 730.00 735.33 755.65 765.50 779.31 800.01 807.72 828.14 837.90 869.37 879.42 960.69 965.18 974.27 977.82 1015.11 1115.84 1123.94 1160.11 1161.95 1215.53 1228.85 1237.95 1326.67 1368.14 1399.38 1432.60 1453.80 1457.16 1465.66 1472.85 1476.83 1491.19 1501.31 1510.38 1547.84 1653.90 1664.44 1672.96 1683.39 1715.59 1724.71 3088.93 3180.73 3193.42 3283.90 3299.54
frequency: 22.10 39.49 41.12 47.80 50.59 54.06 66.90 70.00 77.29 94.11 109.52 121.00 145.26 157.71 173.26 181.90 194.81 203.88 214.26 265.43 333.33 341.12 358.77 362.92 376.56 386.55 463.51 480.48 536.19 558.09 600.64 640.97 692.39 728.13 730.00 735.33 755.65 765.50 779.31 800.01 807.72 828.14 837.90 869.37 879.42 960.69 965.18 974.27 977.82 1015.11 1115.84 1123.94 1160.11 1161.95 1215.53 1228.85 1237.95 1326.67 1368.14 1399.38 1432.60 1453.80 1457.16 1465.66 1472.85 1476.83 1491.19 1501.31 1510.38 1547.84 1653.90 1664.44 1672.96 1683.39 1715.59 1724.71 3088.93 3180.73 3193.42 3283.90 3299.54
formula: C7H5N6O11
InChI: InChI=1S/C7H5N5O8.NO3/c1-8(12(19)20)7-5(10(15)16)2-4(9(13)14)3-6(7)11(17)18;2-1(3)4/h2-3H,1H3;
29 atoms
O  0.233861 0.186355 -0.96085
O  6.848415 -0.253322 0.550902
O  0.913292 1.866657 0.190596
O  5.979582 1.426367 1.576893
O  3.435279 2.149782 -1.662697
O  3.379451 3.976292 -0.494477
O  2.066185 -4.070995 0.137026
O  4.175691 -4.239972 0.525612
N  3.583489 2.050461 0.531843
N  1.049342 0.751358 -0.26177
N  5.903384 0.388481 0.965781
N  3.448028 2.771287 -0.609773
N  3.165526 -3.597075 0.341354
C  3.470827 0.64356 0.420494
C  2.275394 -0.001656 0.070428
C  4.567255 -0.172468 0.673636
C  3.280481 -2.12741 0.347776
C  2.166565 -1.371986 0.034835
C  4.488436 -1.555514 0.663225
C  3.393042 2.729763 1.811709
H  1.22971 -1.841688 -0.219879
H  5.35151 -2.15408 0.902882
H  3.418184 1.973197 2.594325
H  2.427647 3.234191 1.810336
H  4.200041 3.441662 1.965522
O  4.654962 -1.278608 3.433807
O  4.029091 0.560451 4.383386
O  2.680901 -0.479516 3.054922
N  3.788032 -0.400558 3.637796
totalener: -1426.11180787 hartree
nucrepener: 2340.08806215 hartree
electener: -3766.19987002 hartree
oneelecener: -6627.03496593 hartree
twoeener: 2860.83509592 hartree
kineticenergy: 1421.26445582 hartree
exchangeener: -116.782375493615 hartree
correlationener: -7.846841675370 hartree
xcener: -124.629217168985 hartree
temp: 298.15 k
press: 1.00 atm
thermalcorrenthalpy: 0.00094421 hartree
totalenthalpy: -1425.98794111 hartree
totalentropycorr: -0.07221425 hartree
gibbsenthalpy: -1426.06015536 hartree
gibbsminuselec: 0.12415459 hartree
chargesum: -1.0000000
charge: -0.313300 -0.323822 -0.299033 -0.268589 -0.345684 -0.326170 -0.314972 -0.300944 -0.029730 0.490158 0.518648 0.434149 0.468773 -0.009659 0.088513 -0.080883 0.032178 -0.080713 -0.012703 -0.155598 0.155169 0.149988 0.137988 0.114895 0.108017 -0.457064 -0.430727 -0.469648 0.520763
charge: -0.008547 -0.012260 0.010075 0.031404 -0.066244 -0.035454 -0.017692 -0.003373 0.204365 -0.017084 -0.017511 -0.096427 -0.016448 -0.106712 -0.085768 -0.081584 -0.101377 0.059396 0.069911 -0.003354 0.036045 0.043727 0.023530 0.006567 0.010423 -0.188885 -0.176622 -0.196694 -0.263407
qa: -0.3133 -0.3238 -0.2990 -0.2686 -0.3457 -0.3262 -0.3150 -0.3009 -0.0297 0.4902 0.5186 0.4341 0.4688 -0.0097 0.0885 -0.0809 0.0322 -0.0807 -0.0127 -0.1556 0.1552 0.1500 0.1380 0.1149 0.1080 -0.4571 -0.4307 -0.4696 0.5208
va: 1.9589 1.9409 1.9561 1.9781 1.9434 1.9960 1.9712 1.9853 3.0667 4.2633 4.2123 4.5181 4.3343 4.3292 3.9304 4.0401 3.9604 4.1718 4.1599 3.8312 1.0491 1.0571 1.0695 1.0058 0.9993 1.7768 1.8125 1.7382 4.6222
dispcorr: -0.072511754 hartree
energy: -1426.184309351834
dipole: -0.62894 0.22645 -0.40249 4.27044 -4.22783 0.04261 2.71902 -4.84401 -2.12499
quadrupole: 1581.40822 -1701.19734 -0.34094 .55497 -0.75879 2915.86836 -3044.24681 0.46396 0.80134 0.37762 1427.92020 -1558.75944 0.81 -0.22 -0.53 -25.69540 27.27050 7 3 0 504.11351 -512.21503 6 3 6 -237.22144 245.29400 2 1 9
magnitude: 2.16319 au
magnitude: 5.49838 debye
zeropoint: 0.17355316 hartree
thermalvibcorrection: 0.01903778 hartree
thermalrotcorrection: 0.00141627 hartree
thermaltrasncorrection: 0.00141627 hartree
thermaltotal: -1425.98888588 hartree
thermalcorr: 0.02187032 hartree
nonthermalcorr: 0.17355316 hartree
totalcorr: 0.19542348 hartree
totalenthalpy: -1425.98794167 hartree
