program: Orca
programVersion: 5.0.4
elementType: O O O O O O N N N N N N C C C H H H H H H
charge: 0
multiplicity: 1
keywords: wB97X-D3BJ Opt Freq def2-TZVPP def2/J RIJCOSX VeryTightSCF
keywords: PAL8 TightOpt defgrid3
frequency: 0.00 0.00 0.00 0.00 0.00 0.00 32.05 32.26 52.42 79.09 108.56 108.75 225.19 226.32 306.53 380.22 381.16 429.82 429.99 457.90 497.95 609.85 610.20 611.57 680.70 682.07 772.20 797.31 797.85 818.10 894.71 894.72 916.66 946.89 947.15 981.16 1048.52 1049.17 1200.60 1280.79 1295.54 1296.50 1298.53 1353.94 1354.25 1375.02 1405.21 1406.09 1413.71 1430.44 1430.94 1471.79 1471.85 1496.78 1691.60 1728.44 1729.01 3107.13 3108.11 3113.79 3239.94 3240.17 3241.93
frequency: 32.05 32.26 52.42 79.09 108.56 108.75 225.19 226.32 306.53 380.22 381.16 429.82 429.99 457.90 497.95 609.85 610.20 611.57 680.70 682.07 772.20 797.31 797.85 818.10 894.71 894.72 916.66 946.89 947.15 981.16 1048.52 1049.17 1200.60 1280.79 1295.54 1296.50 1298.53 1353.94 1354.25 1375.02 1405.21 1406.09 1413.71 1430.44 1430.94 1471.79 1471.85 1496.78 1691.60 1728.44 1729.01 3107.13 3108.11 3113.79 3239.94 3240.17 3241.93
formula: C3H6N6O6
InChI: InChI=1S/C3H6N6O6/c10-7(11)4-1-5(8(12)13)3-6(2-4)9(14)15/h1-3H2
21 atoms
O  0.358201 0.036348 -0.278641
O  4.962476 0.267612 -0.178957
O  4.481177 3.403256 -0.274924
O  0.020762 2.166703 -0.359444
O  3.30085 -1.109838 -0.147676
O  2.467217 4.177059 -0.343088
N  1.177336 1.320991 1.341585
N  3.43209 0.457279 1.423688
N  3.054004 2.841582 1.334267
N  0.484445 1.165234 0.129139
N  3.92459 -0.161758 0.263049
N  3.350436 3.50707 0.134351
C  2.038677 0.231255 1.770517
C  1.654736 2.652134 1.678127
C  3.945773 1.775199 1.758117
H  1.696804 -0.703106 1.343893
H  1.981495 0.187998 2.859339
H  1.572441 2.756826 2.761211
H  1.046949 3.400634 1.185869
H  4.01278 1.825812 2.846206
H  4.925585 1.91461 1.31935
totalener: -897.95809240 hartree
nucrepener: 1172.00396348 hartree
electener: -2069.96205589 hartree
oneelecener: -3553.82418983 hartree
twoeener: 1483.86213395 hartree
kineticenergy: 894.72411334 hartree
exchangeener: -73.833152350398 hartree
correlationener: -5.016832439853 hartree
xcener: -78.849984790251 hartree
temp: 298.15 k
press: 1.00 atm
thermalcorrenthalpy: 0.00094421 hartree
totalenthalpy: -897.84190699 hartree
totalentropycorr: -0.05152056 hartree
gibbsenthalpy: -897.89342755 hartree
gibbsminuselec: 0.10742749 hartree
chargesum: -0.0000000
charge: -0.286539 -0.286915 -0.287288 -0.286620 -0.286816 -0.287221 -0.048428 -0.049476 -0.050438 0.428897 0.429510 0.430031 -0.125023 -0.124008 -0.123163 0.176889 0.141228 0.141300 0.176512 0.141593 0.175975
charge: -0.004155 -0.004565 -0.004688 -0.004084 -0.004207 -0.004756 0.167978 0.168233 0.168558 -0.098813 -0.098735 -0.098749 -0.110516 -0.110366 -0.110115 0.019778 0.030027 0.029937 0.019709 0.029872 0.019658
qa: -0.2865 -0.2869 -0.2873 -0.2866 -0.2868 -0.2872 -0.0484 -0.0495 -0.0504 0.4289 0.4295 0.4300 -0.1250 -0.1240 -0.1232 0.1769 0.1412 0.1413 0.1765 0.1416 0.1760
va: 2.0000 2.0001 2.0001 2.0003 2.0001 1.9997 2.9305 2.9325 2.9345 4.4768 4.4770 4.4772 4.0510 4.0491 4.0469 1.0232 0.9945 0.9944 1.0235 0.9942 1.0240
dispcorr: -0.042675277 hartree
energy: -898.003258123004
dipole: -0.21497 0.13934 -0.07563 0.27674 -0.18705 0.08969 8.59386 -5.71074 2.88312
quadrupole: 959.16751 -1028.92121 -0.06826 -0.99716 .03193 973.07369 -1043.10629 -0.99739 0.06745 -0.02570 327.72303 -387.87499 -0.02 0.03 0.99 1.49039 -1.51755 3 3 9 15.86121 -16.08625 4 6 1 -20.80521 21.13742 7 0 6
magnitude: 2.88551 au
magnitude: 7.33438 debye
zeropoint: 0.14577806 hartree
thermalvibcorrection: 0.00946474 hartree
thermalrotcorrection: 0.00141627 hartree
thermaltrasncorrection: 0.00141627 hartree
thermaltotal: -897.84518278 hartree
thermalcorr: 0.01229728 hartree
nonthermalcorr: 0.14577806 hartree
totalcorr: 0.15807534 hartree
totalenthalpy: -897.84423857 hartree
