program: Orca
programVersion: 5.0.4
elementType: O O O O O O O O O N N N C C C H H H H H O O O N
charge: -1
multiplicity: 1
keywords: wB97X-D3BJ Opt Freq def2-TZVPP def2/J RIJCOSX VeryTightSCF
keywords: PAL8 TightOpt defgrid3
frequency: 0.00 0.00 0.00 0.00 0.00 0.00 28.31 32.16 38.64 47.38 54.23 67.89 69.54 74.92 78.68 89.67 106.51 114.30 121.72 131.88 177.83 218.78 273.71 295.97 359.58 425.38 467.57 542.53 582.29 629.88 689.16 697.12 710.23 733.70 734.84 781.92 805.90 807.52 812.83 874.04 912.71 918.52 938.36 957.07 980.70 999.90 1061.01 1076.47 1118.09 1120.47 1164.71 1300.08 1302.82 1325.52 1369.43 1372.92 1389.18 1413.54 1424.96 1431.51 1457.73 1491.15 1502.37 1532.21 1744.60 1753.11 1754.05 3090.99 3127.64 3178.63 3191.39 3214.40
frequency: 28.31 32.16 38.64 47.38 54.23 67.89 69.54 74.92 78.68 89.67 106.51 114.30 121.72 131.88 177.83 218.78 273.71 295.97 359.58 425.38 467.57 542.53 582.29 629.88 689.16 697.12 710.23 733.70 734.84 781.92 805.90 807.52 812.83 874.04 912.71 918.52 938.36 957.07 980.70 999.90 1061.01 1076.47 1118.09 1120.47 1164.71 1300.08 1302.82 1325.52 1369.43 1372.92 1389.18 1413.54 1424.96 1431.51 1457.73 1491.15 1502.37 1532.21 1744.60 1753.11 1754.05 3090.99 3127.64 3178.63 3191.39 3214.40
formula: C3H5N4O12
InChI: InChI=1S/C3H5N3O9.NO3/c7-4(8)13-1-3(15-6(11)12)2-14-5(9)10;2-1(3)4/h3H,1-2H2;
24 atoms
O  2.127653 -0.654243 -1.222127
O  -0.522014 -1.277567 0.477354
O  1.743157 2.060491 -1.191889
O  2.853878 -2.408949 -2.220922
O  2.113255 -2.621941 -0.202307
O  -0.528422 -1.944428 -1.638757
O  3.808061 1.781589 -1.97988
O  -1.325149 -3.192818 -0.06627
O  2.233309 2.588346 -3.215997
N  2.378997 -2.005988 -1.199799
N  -0.805998 -2.203979 -0.494982
N  2.682113 2.13195 -2.203553
C  1.590487 -0.064005 -0.004212
C  0.071985 -0.039211 0.027532
C  2.139793 1.353798 0.010797
H  1.969392 -0.582945 0.872082
H  -0.349305 0.250461 -0.932476
H  -0.215149 0.667163 0.809631
H  3.220833 1.358977 0.100994
H  1.672375 1.901107 0.82802
O  0.139982 2.205033 2.331877
O  0.608937 1.877031 4.41679
O  1.523924 0.641268 2.898743
N  0.756531 1.575409 3.233779
totalener: -1239.30414479 hartree
nucrepener: 1638.13182163 hartree
electener: -2877.43596642 hartree
oneelecener: -4975.15943743 hartree
twoeener: 2097.72347102 hartree
kineticenergy: 1235.17225895 hartree
exchangeener: -99.205835781636 hartree
correlationener: -6.560680106113 hartree
xcener: -105.766515887750 hartree
temp: 298.15 k
press: 1.00 atm
thermalcorrenthalpy: 0.00094421 hartree
totalenthalpy: -1239.18146288 hartree
totalentropycorr: -0.06686119 hartree
gibbsenthalpy: -1239.24832407 hartree
gibbsminuselec: 0.09688830 hartree
chargesum: -1.0000000
charge: -0.155231 -0.125773 -0.169996 -0.283444 -0.303449 -0.321976 -0.300523 -0.284997 -0.293080 0.480161 0.483252 0.498458 0.076388 -0.091051 -0.063865 0.143611 0.127926 0.164680 0.128716 0.160207 -0.483972 -0.410529 -0.478875 0.503362
charge: 0.198688 0.210772 0.195596 -0.005736 -0.009614 -0.025725 -0.010947 -0.007416 -0.015062 -0.156507 -0.158451 -0.151813 -0.168032 -0.080834 -0.068249 0.027836 0.008255 0.026701 0.005580 0.017253 -0.211588 -0.160186 -0.205628 -0.254892
qa: -0.1552 -0.1258 -0.1700 -0.2834 -0.3034 -0.3220 -0.3005 -0.2850 -0.2931 0.4802 0.4833 0.4985 0.0764 -0.0911 -0.0639 0.1436 0.1279 0.1647 0.1287 0.1602 -0.4840 -0.4105 -0.4789 0.5034
va: 2.0652 2.0700 2.0509 2.0318 1.9820 1.9574 2.0084 2.0265 2.0220 4.6006 4.5867 4.5933 3.8972 3.8378 3.8059 1.0332 1.0184 1.0537 1.0210 1.0693 1.7230 1.8550 1.7291 4.6331
dispcorr: -0.041161771 hartree
energy: -1239.345572033822
dipole: 0.08820 0.49032 0.57852 3.41554 -4.13613 -0.72059 2.10555 -4.80399 -2.69843
quadrupole: 1034.07447 -1121.70502 -0.19318 .37000 .90872 1934.62561 -2039.37577 0.25834 0.91267 -0.31669 2098.48914 -2226.55232 0.94 -0.17 0.27 485.46375 -485.56344 6 3 1 -580.34094 590.51532 5 5 9 401.69129 -414.15115 4 8 0
magnitude: 2.85228 au
magnitude: 7.24991 debye
zeropoint: 0.14419168 hartree
thermalvibcorrection: 0.01579051 hartree
thermalrotcorrection: 0.00141627 hartree
thermaltrasncorrection: 0.00141627 hartree
thermaltotal: -1239.18275731 hartree
thermalcorr: 0.01862305 hartree
nonthermalcorr: 0.14419168 hartree
totalcorr: 0.16281473 hartree
totalenthalpy: -1239.18181310 hartree
