program: Orca
programVersion: 5.0.4
elementType: O O O O O O O O O N N N C C C H H H H H O O O N
charge: -1
multiplicity: 1
keywords: wB97X-D3BJ Opt Freq def2-TZVPP def2/J RIJCOSX VeryTightSCF
keywords: PAL8 TightOpt defgrid3
frequency: 0.00 0.00 0.00 0.00 0.00 0.00 22.69 27.71 42.73 45.63 46.81 65.07 67.37 78.25 81.64 89.74 102.81 111.47 114.30 125.24 184.36 230.95 268.72 310.90 372.80 409.43 447.53 542.20 577.66 630.15 675.69 694.41 709.95 732.01 735.06 745.89 804.80 808.49 812.81 874.38 904.23 917.42 931.17 952.66 976.20 1023.19 1055.12 1106.01 1118.45 1134.67 1155.80 1279.54 1314.46 1317.12 1351.90 1376.97 1391.90 1418.05 1432.06 1441.66 1453.69 1475.17 1488.25 1528.29 1751.19 1754.64 1756.97 3129.33 3143.28 3177.86 3210.94 3227.45
frequency: 22.69 27.71 42.73 45.63 46.81 65.07 67.37 78.25 81.64 89.74 102.81 111.47 114.30 125.24 184.36 230.95 268.72 310.90 372.80 409.43 447.53 542.20 577.66 630.15 675.69 694.41 709.95 732.01 735.06 745.89 804.80 808.49 812.81 874.38 904.23 917.42 931.17 952.66 976.20 1023.19 1055.12 1106.01 1118.45 1134.67 1155.80 1279.54 1314.46 1317.12 1351.90 1376.97 1391.90 1418.05 1432.06 1441.66 1453.69 1475.17 1488.25 1528.29 1751.19 1754.64 1756.97 3129.33 3143.28 3177.86 3210.94 3227.45
formula: C3H5N4O12
InChI: InChI=1S/C3H5N3O9.NO3/c7-4(8)13-1-3(15-6(11)12)2-14-5(9)10;2-1(3)4/h3H,1-2H2;
24 atoms
O  2.052914 -0.629563 -1.198895
O  -0.546815 -1.350556 -0.220791
O  3.430295 1.375123 0.330759
O  2.203516 -2.510998 -0.016895
O  2.792872 -2.437112 -2.092373
O  -0.229926 -1.503826 1.9691
O  3.904905 1.781861 -1.808147
O  -1.046606 -3.155395 0.838756
O  5.459078 1.34191 -0.375643
N  2.366391 -1.969756 -1.077759
N  -0.605667 -2.049883 0.968024
N  4.3219 1.508363 -0.718557
C  1.479715 0.011289 -0.023291
C  -0.034958 -0.000809 -0.117314
C  2.022974 1.42632 -0.006775
H  1.822925 -0.521617 0.859142
H  -0.374515 0.467926 -1.036585
H  -0.46963 0.535621 0.723879
H  1.5355 1.99044 0.788077
H  1.867008 1.946419 -0.944892
O  -0.49892 2.899934 -0.705888
O  -1.586939 4.299091 0.529555
O  -0.445395 2.711932 1.45119
N  -0.852905 3.316302 0.424209
totalener: -1239.30642043 hartree
nucrepener: 1618.74571764 hartree
electener: -2858.05213807 hartree
oneelecener: -4936.07580548 hartree
twoeener: 2078.02366740 hartree
kineticenergy: 1235.17958940 hartree
exchangeener: -99.205428393080 hartree
correlationener: -6.559992641350 hartree
xcener: -105.765421034430 hartree
temp: 298.15 k
press: 1.00 atm
thermalcorrenthalpy: 0.00094421 hartree
totalenthalpy: -1239.18325941 hartree
totalentropycorr: -0.06721200 hartree
gibbsenthalpy: -1239.25047141 hartree
gibbsminuselec: 0.09652997 hartree
chargesum: -1.0000000
charge: -0.161970 -0.161038 -0.165031 -0.310087 -0.279319 -0.299962 -0.287541 -0.293178 -0.296349 0.507330 0.506960 0.486851 0.026837 -0.070834 -0.072400 0.130219 0.141558 0.160260 0.155155 0.155736 -0.478974 -0.417186 -0.489598 0.512560
charge: 0.204008 0.189503 0.191465 -0.011355 -0.003407 -0.001424 -0.000451 -0.013721 -0.022250 -0.149624 -0.153634 -0.153484 -0.170299 -0.083513 -0.071858 0.012026 0.028053 0.017120 0.023926 0.011848 -0.209204 -0.165632 -0.213315 -0.254776
qa: -0.1620 -0.1610 -0.1650 -0.3101 -0.2793 -0.3000 -0.2875 -0.2932 -0.2963 0.5073 0.5070 0.4869 0.0268 -0.0708 -0.0724 0.1302 0.1416 0.1603 0.1552 0.1557 -0.4790 -0.4172 -0.4896 0.5126
va: 2.0498 2.0575 2.0573 1.9836 2.0361 1.9935 2.0159 2.0170 2.0115 4.5717 4.5579 4.5896 3.8653 3.9066 3.8575 1.0247 1.0178 1.0509 1.0604 1.0295 1.7277 1.8467 1.7105 4.6160
dispcorr: -0.040716956 hartree
energy: -1239.347920570640
dipole: -1.84224 3.51945 1.67721 2.86987 -5.27040 -2.40053 0.81479 -1.20921 -0.39442
quadrupole: 2196.32593 -2304.87311 .55428 -0.81349 -0.17611 2503.41324 -2626.29249 -0.68917 -0.56719 0.45093 560.73196 -652.92643 0.46 0.12 0.87 -90.27421 105.90123 6 8 5 -633.55021 642.17876 7 5 0 64.48453 -67.70447 1 6 1
magnitude: 2.95485 au
magnitude: 7.51064 debye
zeropoint: 0.14417446 hartree
thermalvibcorrection: 0.01585726 hartree
thermalrotcorrection: 0.00141627 hartree
thermaltrasncorrection: 0.00141627 hartree
thermaltotal: -1239.18505630 hartree
thermalcorr: 0.01868980 hartree
nonthermalcorr: 0.14417446 hartree
totalcorr: 0.16286427 hartree
totalenthalpy: -1239.18411209 hartree
