program: Orca
programVersion: 5.0.4
elementType: O O O O O O O O O N N N C C C H H H H H
charge: 0
multiplicity: 1
keywords: wB97X-D3BJ Opt Freq def2-TZVPP def2/J RIJCOSX VeryTightSCF
keywords: PAL8 TightOpt defgrid3
frequency: 0.00 0.00 0.00 0.00 0.00 0.00 32.69 41.83 45.01 65.31 70.83 79.02 92.48 110.77 179.25 228.17 268.25 313.68 378.47 401.90 440.06 541.32 574.74 623.96 665.96 674.97 707.41 738.55 795.73 799.01 804.90 886.39 890.38 910.58 935.29 960.28 1050.95 1095.99 1131.97 1141.07 1167.47 1292.96 1318.15 1330.08 1355.19 1375.39 1386.24 1431.97 1439.16 1451.99 1476.77 1488.44 1789.17 1792.13 1795.49 3108.64 3116.27 3165.77 3171.56 3184.17
frequency: 32.69 41.83 45.01 65.31 70.83 79.02 92.48 110.77 179.25 228.17 268.25 313.68 378.47 401.90 440.06 541.32 574.74 623.96 665.96 674.97 707.41 738.55 795.73 799.01 804.90 886.39 890.38 910.58 935.29 960.28 1050.95 1095.99 1131.97 1141.07 1167.47 1292.96 1318.15 1330.08 1355.19 1375.39 1386.24 1431.97 1439.16 1451.99 1476.77 1488.44 1789.17 1792.13 1795.49 3108.64 3116.27 3165.77 3171.56 3184.17
formula: C3H5N3O9
InChI: InChI=1S/C3H5N3O9/c7-4(8)13-1-3(15-6(11)12)2-14-5(9)10/h3H,1-2H2
20 atoms
O  1.771517 -0.430667 -1.229717
O  -0.581273 -1.322364 0.2185
O  3.576482 1.206975 0.186421
O  2.044673 -2.549968 -0.570005
O  2.183181 -1.995654 -2.655203
O  0.240717 -1.880022 2.210603
O  3.294756 2.231468 -1.785128
O  -0.867729 -3.306655 1.018985
O  5.21526 1.430684 -1.198943
N  2.020291 -1.79157 -1.497056
N  -0.375945 -2.251221 1.249086
N  4.058814 1.666238 -1.059323
C  1.545856 -0.098628 0.149614
C  0.051207 -0.057231 0.431023
C  2.161649 1.275976 0.361405
H  2.046898 -0.826951 0.782272
H  -0.44862 0.587707 -0.292146
H  -0.143076 0.301977 1.441393
H  2.012985 1.588085 1.395678
H  1.734436 2.019436 -0.309038
totalener: -958.73978771 hartree
nucrepener: 1128.57911400 hartree
electener: -2087.31890171 hartree
oneelecener: -3554.01958394 hartree
twoeener: 1466.70068223 hartree
kineticenergy: 955.40413690 hartree
exchangeener: -77.186386931702 hartree
correlationener: -5.128992724540 hartree
xcener: -82.315379656241 hartree
temp: 298.15 k
press: 1.00 atm
thermalcorrenthalpy: 0.00094421 hartree
totalenthalpy: -958.63001676 hartree
totalentropycorr: -0.05532846 hartree
gibbsenthalpy: -958.68534521 hartree
gibbsminuselec: 0.08750210 hartree
chargesum: -0.0000000
charge: -0.175966 -0.157457 -0.170673 -0.291688 -0.240622 -0.299830 -0.276895 -0.244062 -0.246782 0.519709 0.518353 0.502437 0.029938 -0.081914 -0.076992 0.145162 0.137913 0.134618 0.133875 0.140876
charge: 0.195281 0.192601 0.189629 0.009015 0.038863 -0.000378 0.014049 0.039453 0.031743 -0.138667 -0.143717 -0.141371 -0.193050 -0.104241 -0.096547 0.015129 0.032577 0.018297 0.030634 0.010702
qa: -0.1760 -0.1575 -0.1707 -0.2917 -0.2406 -0.2998 -0.2769 -0.2441 -0.2468 0.5197 0.5184 0.5024 0.0299 -0.0819 -0.0770 0.1452 0.1379 0.1346 0.1339 0.1409
va: 2.0454 2.0659 2.0584 2.0036 2.0840 1.9907 2.0294 2.0778 2.0732 4.5420 4.5287 4.5616 3.8869 3.9704 3.9472 1.0180 0.9978 1.0035 0.9971 1.0168
dispcorr: -0.033113002 hartree
energy: -958.775456405764
dipole: -3.37071 2.47512 -0.89559 5.93268 -4.40158 1.53110 4.14984 -3.13130 1.01854
quadrupole: 1275.62596 -1342.77934 -0.58630 -0.65315 .47922 1242.04999 -1308.52788 0.57649 0.07921 0.81326 675.89240 -743.18522 0.56 -0.75 -0.33 883.67457 -890.78784 9 3 0 -568.72275 570.63038 1 0 0 -261.71093 266.85439 4 8 9
magnitude: 2.04543 au
magnitude: 5.19907 debye
zeropoint: 0.12829314 hartree
thermalvibcorrection: 0.01096464 hartree
thermalrotcorrection: 0.00141627 hartree
thermaltrasncorrection: 0.00141627 hartree
thermaltotal: -958.63336608 hartree
thermalcorr: 0.01379718 hartree
nonthermalcorr: 0.12829314 hartree
totalcorr: 0.14209032 hartree
totalenthalpy: -958.63242187 hartree
