program: Orca
programVersion: 5.0.4
elementType: O O O O O O O O O N N N C C C H H H H H
charge: 0
multiplicity: 1
keywords: wB97X-D3BJ Opt Freq def2-TZVPP def2/J RIJCOSX VeryTightSCF
keywords: PAL8 TightOpt defgrid3
frequency: 0.00 0.00 0.00 0.00 0.00 0.00 33.82 44.13 46.19 60.15 73.86 78.99 94.21 123.97 194.03 211.92 264.93 288.79 389.33 427.36 462.45 544.10 578.43 629.96 672.41 675.16 743.45 745.83 796.80 798.92 803.54 883.62 894.61 896.96 936.79 949.64 989.49 1085.38 1090.04 1146.64 1182.64 1290.64 1313.65 1338.82 1353.94 1372.93 1382.92 1421.46 1432.89 1447.66 1484.94 1489.31 1790.35 1792.39 1795.53 3115.70 3120.28 3132.13 3193.39 3196.72
frequency: 33.82 44.13 46.19 60.15 73.86 78.99 94.21 123.97 194.03 211.92 264.93 288.79 389.33 427.36 462.45 544.10 578.43 629.96 672.41 675.16 743.45 745.83 796.80 798.92 803.54 883.62 894.61 896.96 936.79 949.64 989.49 1085.38 1090.04 1146.64 1182.64 1290.64 1313.65 1338.82 1353.94 1372.93 1382.92 1421.46 1432.89 1447.66 1484.94 1489.31 1790.35 1792.39 1795.53 3115.70 3120.28 3132.13 3193.39 3196.72
formula: C3H5N3O9
InChI: InChI=1S/C3H5N3O9/c7-4(8)13-1-3(15-6(11)12)2-14-5(9)10/h3H,1-2H2
20 atoms
O  1.932241 -0.712059 -1.314044
O  -0.441168 -1.390577 0.042202
O  1.651779 2.185288 -0.973615
O  3.909676 -1.136659 -0.382244
O  3.484219 -1.723466 -2.421192
O  -1.023975 -1.249055 -2.115208
O  3.47364 1.692174 -2.171341
O  -1.17618 -3.112569 -1.029956
O  1.900564 2.935438 -2.981088
N  3.233575 -1.235991 -1.369048
N  -0.918253 -1.959039 -1.159677
N  2.422601 2.266357 -2.149987
C  1.584055 -0.081128 -0.070692
C  0.063432 -0.05844 -0.062469
C  2.174157 1.317042 0.03984
H  1.949353 -0.687068 0.75943
H  -0.335456 0.435956 -0.944512
H  -0.287962 0.456874 0.832152
H  3.259451 1.292521 0.002077
H  1.858715 1.775401 0.978103
totalener: -958.74000665 hartree
nucrepener: 1142.36444814 hartree
electener: -2101.10445479 hartree
oneelecener: -3581.68442546 hartree
twoeener: 1480.57997067 hartree
kineticenergy: 955.41634310 hartree
exchangeener: -77.188756875101 hartree
correlationener: -5.129742996135 hartree
xcener: -82.318499871236 hartree
temp: 298.15 k
press: 1.00 atm
thermalcorrenthalpy: 0.00094421 hartree
totalenthalpy: -958.63046374 hartree
totalentropycorr: -0.05503340 hartree
gibbsenthalpy: -958.68549714 hartree
gibbsminuselec: 0.08788740 hartree
chargesum: 0.0000000
charge: -0.171910 -0.173575 -0.172761 -0.295150 -0.240682 -0.272459 -0.294777 -0.250856 -0.247580 0.513006 0.503331 0.526026 0.052172 -0.057159 -0.119318 0.125470 0.155080 0.123631 0.165538 0.131971
charge: 0.195411 0.185917 0.186131 0.003176 0.043010 0.017778 0.007813 0.027639 0.035202 -0.140922 -0.141610 -0.140939 -0.193774 -0.097846 -0.097817 0.027755 0.011625 0.029281 0.010796 0.031375
qa: -0.1719 -0.1736 -0.1728 -0.2951 -0.2407 -0.2725 -0.2948 -0.2509 -0.2476 0.5130 0.5033 0.5260 0.0522 -0.0572 -0.1193 0.1255 0.1551 0.1236 0.1655 0.1320
va: 2.0602 2.0524 2.0380 2.0000 2.0820 2.0341 2.0064 2.0675 2.0807 4.5372 4.5609 4.5309 3.9317 3.8865 3.9287 1.0168 1.0255 1.0010 1.0043 1.0007
dispcorr: -0.033280242 hartree
energy: -958.776045273850
dipole: -0.93275 0.71128 -0.22147 3.79101 -2.80123 0.98978 7.24093 -5.32419 1.91674
quadrupole: 1226.75947 -1294.33297 -0.37188 -0.84240 .38996 1289.46715 -1358.32944 -0.92443 0.29783 -0.23819 412.49469 -474.09778 -0.08 0.44 0.88 499.29938 -501.11961 4 9 9 -152.32594 152.45442 5 0 4 -178.20520 182.88344 1 7 9
magnitude: 2.16855 au
magnitude: 5.51201 debye
zeropoint: 0.12827036 hartree
thermalvibcorrection: 0.01090415 hartree
thermalrotcorrection: 0.00141627 hartree
thermaltrasncorrection: 0.00141627 hartree
thermaltotal: -958.63403822 hartree
thermalcorr: 0.01373669 hartree
nonthermalcorr: 0.12827036 hartree
totalcorr: 0.14200705 hartree
totalenthalpy: -958.63309401 hartree
