program: Orca
programVersion: 5.0.4
elementType: O N O O O N O O C C O N O O C C O N O O H H H H H H N O O O
charge: -1
multiplicity: 1
keywords: wB97X-D3BJ Opt Freq def2-TZVPP def2/J RIJCOSX VeryTightSCF
keywords: PAL8 TightOpt defgrid3
frequency: 0.00 0.00 0.00 0.00 0.00 0.00 27.53 30.29 35.25 40.38 44.74 51.96 57.25 63.15 71.41 72.93 76.92 87.07 95.83 107.96 111.55 117.16 126.00 143.23 161.88 243.01 245.93 249.30 270.29 311.32 385.18 404.87 462.76 515.76 571.73 599.52 602.08 673.00 696.44 700.90 722.97 733.42 735.83 743.80 802.56 804.38 806.76 810.39 831.46 873.03 877.14 917.42 926.49 941.37 954.53 978.51 1006.28 1035.69 1045.51 1078.05 1108.32 1118.79 1134.39 1183.88 1287.05 1300.59 1323.71 1355.46 1361.55 1378.68 1387.75 1391.45 1421.19 1427.27 1435.02 1439.48 1463.44 1481.50 1488.86 1540.26 1750.02 1756.47 1759.07 1768.66 3078.02 3130.09 3161.12 3165.73 3205.91 3228.19
frequency: 27.53 30.29 35.25 40.38 44.74 51.96 57.25 63.15 71.41 72.93 76.92 87.07 95.83 107.96 111.55 117.16 126.00 143.23 161.88 243.01 245.93 249.30 270.29 311.32 385.18 404.87 462.76 515.76 571.73 599.52 602.08 673.00 696.44 700.90 722.97 733.42 735.83 743.80 802.56 804.38 806.76 810.39 831.46 873.03 877.14 917.42 926.49 941.37 954.53 978.51 1006.28 1035.69 1045.51 1078.05 1108.32 1118.79 1134.39 1183.88 1287.05 1300.59 1323.71 1355.46 1361.55 1378.68 1387.75 1391.45 1421.19 1427.27 1435.02 1439.48 1463.44 1481.50 1488.86 1540.26 1750.02 1756.47 1759.07 1768.66 3078.02 3130.09 3161.12 3165.73 3205.91 3228.19
formula: C4H6N5O15
InChI: InChI=1S/C4H6N4O12.NO3/c9-5(10)17-1-3(19-7(13)14)4(20-8(15)16)2-18-6(11)12;2-1(3)4/h3-4H,1-2H2;
30 atoms
O  1.910738 -0.689378 -1.247727
N  1.838061 -2.070096 -1.214773
O  1.319586 -2.590697 -0.267242
O  2.315372 -2.581127 -2.186345
O  1.851735 2.015102 -1.252455
N  2.864948 2.694278 -1.90052
O  2.493859 3.236355 -2.896225
O  3.966984 2.671505 -1.420278
C  1.942121 2.102148 1.214112
C  2.217889 1.295221 -0.046694
O  3.087309 2.885045 1.616604
N  3.170338 4.154527 1.084833
O  4.130115 4.757792 1.464669
O  2.305142 4.520252 0.332865
C  1.432726 -0.010925 -0.056189
C  -0.083808 0.07491 -0.033778
O  -0.640148 0.541826 -1.283222
N  -1.040644 1.864627 -1.324764
O  -1.447948 2.188649 -2.399975
O  -0.964547 2.522539 -0.322591
H  1.070116 2.739781 1.100468
H  1.800594 1.410609 2.044392
H  -0.497199 -0.923103 0.084378
H  -0.414634 0.680838 0.802536
H  3.275962 1.047416 -0.09397
H  1.744833 -0.551567 0.84256
N  1.429588 -0.819999 3.362378
O  2.522495 -0.770504 2.741443
O  1.324113 -1.463548 4.401653
O  0.444676 -0.189904 2.892595
totalener: -1558.48587412 hartree
nucrepener: 2451.68792381 hartree
electener: -4010.17379794 hartree
oneelecener: -7036.80553065 hartree
twoeener: 3026.63173272 hartree
kineticenergy: 1553.28631740 hartree
exchangeener: -124.837217008127 hartree
correlationener: -8.258049015672 hartree
xcener: -133.095266023799 hartree
temp: 298.15 k
press: 1.00 atm
thermalcorrenthalpy: 0.00094421 hartree
totalenthalpy: -1558.33811675 hartree
totalentropycorr: -0.07615671 hartree
gibbsenthalpy: -1558.41427345 hartree
gibbsminuselec: 0.12834114 hartree
chargesum: -1.0000000
charge: -0.157747 0.498790 -0.287409 -0.289156 -0.155393 0.486473 -0.270438 -0.305147 -0.077314 0.038071 -0.134567 0.491511 -0.282039 -0.314507 0.036391 -0.144863 -0.155332 0.520680 -0.277953 -0.314602 0.143325 0.167799 0.147958 0.161951 0.139753 0.189706 0.513015 -0.477977 -0.399213 -0.491767
charge: 0.203153 -0.146676 0.011225 -0.010764 0.205289 -0.150830 0.010098 -0.010632 -0.075294 -0.157409 0.205048 -0.155496 -0.004093 -0.015757 -0.158793 -0.088339 0.193671 -0.152733 0.000682 -0.008157 0.009098 0.025758 0.024884 0.015734 0.028562 0.018351 -0.253319 -0.201452 -0.148083 -0.213727
qa: -0.1577 0.4988 -0.2874 -0.2892 -0.1554 0.4865 -0.2704 -0.3051 -0.0773 0.0381 -0.1346 0.4915 -0.2820 -0.3145 0.0364 -0.1449 -0.1553 0.5207 -0.2780 -0.3146 0.1433 0.1678 0.1480 0.1620 0.1398 0.1897 0.5130 -0.4780 -0.3992 -0.4918
va: 2.0727 4.5602 2.0072 2.0237 2.0701 4.5985 2.0592 1.9841 3.8651 3.8974 2.0684 4.5675 2.0320 1.9713 3.8578 3.9706 2.0450 4.5556 2.0443 1.9768 1.0093 1.0550 1.0124 1.0143 1.0329 1.0743 4.6152 1.7326 1.8776 1.7008
dispcorr: -0.056740348 hartree
energy: -1558.542614628833
dipole: -2.45162 2.02948 -0.42213 -2.04873 3.18434 1.13562 4.15421 -6.45346 -2.29926
quadrupole: 1517.46317 -1630.95194 .00775 -0.59361 .80471 3096.84038 -3231.19804 0.37032 0.74922 0.54911 2422.01025 -2567.83857 0.92 -0.29 -0.22 539.35117 -541.84525 8 3 5 256.62720 -258.91098 8 7 6 -379.31563 397.96623 7 5 3
magnitude: 2.59892 au
magnitude: 6.60594 debye
zeropoint: 0.18023055 hartree
thermalvibcorrection: 0.02049054 hartree
thermalrotcorrection: 0.00141627 hartree
thermaltrasncorrection: 0.00141627 hartree
thermaltotal: -1558.33906099 hartree
thermalcorr: 0.02332308 hartree
nonthermalcorr: 0.18023055 hartree
totalcorr: 0.20355364 hartree
totalenthalpy: -1558.33811678 hartree
