program: Orca
programVersion: 5.0.4
elementType: O N O O O N O O C C O N O O C C O N O O H H H H H H
charge: 0
multiplicity: 1
keywords: wB97X-D3BJ Opt Freq def2-TZVPP def2/J RIJCOSX VeryTightSCF
keywords: PAL8 TightOpt defgrid3
frequency: 0.00 0.00 0.00 0.00 0.00 0.00 16.77 32.48 49.72 55.47 57.82 71.56 73.39 84.77 85.88 101.59 133.39 166.89 188.84 225.04 251.44 261.23 272.12 282.50 410.89 419.27 482.16 538.02 571.78 588.56 615.76 666.23 681.41 709.98 715.81 755.58 796.41 799.21 799.46 801.24 846.57 864.20 884.72 898.89 914.04 918.69 953.87 970.78 1037.85 1063.22 1085.80 1120.41 1142.54 1192.88 1303.16 1315.18 1338.62 1355.04 1360.37 1373.98 1387.73 1389.37 1419.05 1427.24 1438.99 1446.56 1485.25 1487.92 1785.07 1790.65 1797.11 1800.21 3106.32 3115.23 3129.20 3145.08 3188.77 3200.53
frequency: 16.77 32.48 49.72 55.47 57.82 71.56 73.39 84.77 85.88 101.59 133.39 166.89 188.84 225.04 251.44 261.23 272.12 282.50 410.89 419.27 482.16 538.02 571.78 588.56 615.76 666.23 681.41 709.98 715.81 755.58 796.41 799.21 799.46 801.24 846.57 864.20 884.72 898.89 914.04 918.69 953.87 970.78 1037.85 1063.22 1085.80 1120.41 1142.54 1192.88 1303.16 1315.18 1338.62 1355.04 1360.37 1373.98 1387.73 1389.37 1419.05 1427.24 1438.99 1446.56 1485.25 1487.92 1785.07 1790.65 1797.11 1800.21 3106.32 3115.23 3129.20 3145.08 3188.77 3200.53
formula: C4H6N4O12
InChI: InChI=1S/C4H6N4O12/c9-5(10)17-1-3(19-7(13)14)4(20-8(15)16)2-18-6(11)12/h3-4H,1-2H2
26 atoms
O  2.026715 -0.70254 -1.134129
N  1.912859 -2.097602 -1.048127
O  1.393173 -2.549725 -0.064085
O  2.377467 -2.651071 -1.988316
O  1.937046 1.990434 -1.312973
N  2.969779 2.854292 -1.722587
O  2.739369 3.370618 -2.764024
O  3.92182 2.96014 -0.999246
C  1.791682 2.276884 1.110522
C  2.156939 1.355616 -0.047732
O  0.429782 2.710671 1.066236
N  0.201194 3.9239 0.378208
O  -0.954916 4.179337 0.302931
O  1.156287 4.531198 -0.010614
C  1.398934 0.025939 -0.064323
C  -0.119784 0.062111 -0.202613
O  -0.577302 0.82267 -1.321017
N  -0.731161 0.099574 -2.514454
O  -1.049112 0.793344 -3.424098
O  -0.550066 -1.086371 -2.479272
H  1.876395 1.738418 2.055699
H  2.46055 3.133494 1.130361
H  -0.511034 -0.950778 -0.244932
H  -0.548345 0.573853 0.656462
H  3.216211 1.113645 0.049475
H  1.618248 -0.472604 0.883042
totalener: -1277.91147498 hartree
nucrepener: 1858.10711769 hartree
electener: -3136.01859267 hartree
oneelecener: -5444.52671684 hartree
twoeener: 2308.50812417 hartree
kineticenergy: 1273.52757484 hartree
exchangeener: -102.818594228854 hartree
correlationener: -6.826507519134 hartree
xcener: -109.645101747988 hartree
temp: 298.15 k
press: 1.00 atm
thermalcorrenthalpy: 0.00094421 hartree
totalenthalpy: -1277.77624524 hartree
totalentropycorr: -0.06460342 hartree
gibbsenthalpy: -1277.84084866 hartree
gibbsminuselec: 0.11918712 hartree
chargesum: -0.0000000
charge: -0.156343 0.519462 -0.298680 -0.239498 -0.161175 0.512904 -0.234855 -0.294247 -0.130194 0.065870 -0.183272 0.535557 -0.244535 -0.291040 0.017454 -0.113483 -0.155015 0.523348 -0.244247 -0.305192 0.131183 0.171635 0.170476 0.136983 0.140480 0.126423
charge: 0.200612 -0.140887 0.000781 0.046129 0.202033 -0.138616 0.049800 0.003770 -0.098466 -0.185366 0.184117 -0.138618 0.042170 0.012880 -0.177220 -0.106643 0.197032 -0.140643 0.038490 -0.001833 0.031773 0.014358 0.010939 0.027201 0.032344 0.033862
qa: -0.1563 0.5195 -0.2987 -0.2395 -0.1612 0.5129 -0.2349 -0.2942 -0.1302 0.0659 -0.1833 0.5356 -0.2445 -0.2910 0.0175 -0.1135 -0.1550 0.5233 -0.2442 -0.3052 0.1312 0.1716 0.1705 0.1370 0.1405 0.1264
va: 2.0726 4.5235 1.9947 2.0854 2.0718 4.5389 2.0936 2.0033 3.9345 3.8912 2.0249 4.5196 2.0887 2.0136 4.0169 3.9241 2.0477 4.5293 2.0868 1.9947 1.0011 1.0020 1.0011 1.0130 1.0196 1.0152
dispcorr: -0.048472695 hartree
energy: -1277.963408542684
dipole: 1.31263 -0.81941 0.49322 -1.63164 1.26646 -0.36518 9.42863 -6.95362 2.47501
quadrupole: 1141.89568 -1227.69485 .15463 -0.98575 -0.06630 2642.79865 -2740.08884 -0.92441 -0.16803 0.34239 914.75978 -996.58622 0.34 -0.00 0.93 57.55638 -55.81956 8 8 7 54.25526 -52.51906 6 3 2 443.01365 -443.80321 5 4 2
magnitude: 2.54996 au
magnitude: 6.48149 debye
zeropoint: 0.16458341 hartree
thermalvibcorrection: 0.01541160 hartree
thermalrotcorrection: 0.00141627 hartree
thermaltrasncorrection: 0.00141627 hartree
thermaltotal: -1277.78058098 hartree
thermalcorr: 0.01824414 hartree
nonthermalcorr: 0.16458341 hartree
totalcorr: 0.18282756 hartree
totalenthalpy: -1277.77963678 hartree
