program: Orca
programVersion: 5.0.4
elementType: O N O O O N O O C C O N O O C C O N O O H H H H H H
charge: 0
multiplicity: 1
keywords: wB97X-D3BJ Opt Freq def2-TZVPP def2/J RIJCOSX VeryTightSCF
keywords: PAL8 TightOpt defgrid3
frequency: 0.00 0.00 0.00 0.00 0.00 0.00 12.66 30.41 40.53 53.15 59.62 67.08 71.72 75.85 86.91 113.20 128.18 142.23 175.21 239.37 242.20 258.69 302.09 314.82 376.84 387.52 461.62 509.31 568.19 592.01 606.14 657.75 683.84 688.93 705.93 738.34 794.97 799.31 800.22 802.09 854.71 867.63 892.47 900.35 917.39 933.27 959.39 1002.51 1039.10 1076.95 1097.22 1122.17 1147.58 1182.30 1289.28 1323.06 1325.26 1352.96 1360.94 1373.19 1378.69 1387.27 1423.46 1431.85 1439.27 1450.15 1475.08 1484.68 1784.80 1792.54 1793.03 1803.11 3108.23 3111.25 3125.02 3151.99 3179.27 3192.83
frequency: 12.66 30.41 40.53 53.15 59.62 67.08 71.72 75.85 86.91 113.20 128.18 142.23 175.21 239.37 242.20 258.69 302.09 314.82 376.84 387.52 461.62 509.31 568.19 592.01 606.14 657.75 683.84 688.93 705.93 738.34 794.97 799.31 800.22 802.09 854.71 867.63 892.47 900.35 917.39 933.27 959.39 1002.51 1039.10 1076.95 1097.22 1122.17 1147.58 1182.30 1289.28 1323.06 1325.26 1352.96 1360.94 1373.19 1378.69 1387.27 1423.46 1431.85 1439.27 1450.15 1475.08 1484.68 1784.80 1792.54 1793.03 1803.11 3108.23 3111.25 3125.02 3151.99 3179.27 3192.83
formula: C4H6N4O12
InChI: InChI=1S/C4H6N4O12/c9-5(10)17-1-3(19-7(13)14)4(20-8(15)16)2-18-6(11)12/h3-4H,1-2H2
26 atoms
O  2.158487 -0.640219 -1.233976
N  2.137312 -2.038172 -1.244371
O  1.69382 -2.591512 -0.272709
O  2.58413 -2.496238 -2.243139
O  1.824078 1.974543 -1.32401
N  2.842683 2.725325 -1.939257
O  2.516079 3.131695 -3.003542
O  3.871378 2.86704 -1.338818
C  1.630804 2.20049 1.109794
C  2.161863 1.38008 -0.063403
O  2.6065 3.110253 1.628531
N  2.629281 4.378588 1.022776
O  3.469437 5.081535 1.480092
O  1.826175 4.594269 0.159284
C  1.582589 -0.038029 -0.065215
C  0.056788 -0.129319 -0.008621
O  -0.627524 0.900862 -0.722527
N  -0.814693 0.649731 -2.097656
O  -1.31405 1.567953 -2.65845
O  -0.477575 -0.422461 -2.511173
H  0.715624 2.721823 0.835114
H  1.438869 1.548599 1.963201
H  -0.285393 -1.112153 -0.320481
H  -0.264303 0.033295 1.020967
H  3.245295 1.302398 0.011406
H  1.96826 -0.551124 0.818183
totalener: -1277.90931610 hartree
nucrepener: 1829.63508549 hartree
electener: -3107.54440159 hartree
oneelecener: -5387.31893898 hartree
twoeener: 2279.77453739 hartree
kineticenergy: 1273.49851872 hartree
exchangeener: -102.813363063030 hartree
correlationener: -6.825557063889 hartree
xcener: -109.638920126919 hartree
temp: 298.15 k
press: 1.00 atm
thermalcorrenthalpy: 0.00094421 hartree
totalenthalpy: -1277.77396475 hartree
totalentropycorr: -0.06504570 hartree
gibbsenthalpy: -1277.83901045 hartree
gibbsminuselec: 0.11843956 hartree
chargesum: -0.0000000
charge: -0.140833 0.513786 -0.304842 -0.238666 -0.161565 0.501424 -0.233293 -0.291302 -0.106760 0.097319 -0.151865 0.504812 -0.242196 -0.293783 -0.039467 -0.103839 -0.170782 0.527883 -0.243660 -0.285630 0.162262 0.124753 0.162890 0.127723 0.144186 0.141443
charge: 0.207037 -0.139113 -0.003529 0.046192 0.199413 -0.140666 0.049814 0.004883 -0.096868 -0.175269 0.188245 -0.145732 0.038729 0.006541 -0.182437 -0.109163 0.185799 -0.141618 0.042674 0.009918 0.019975 0.029902 0.014282 0.032096 0.025138 0.033757
qa: -0.1408 0.5138 -0.3048 -0.2387 -0.1616 0.5014 -0.2333 -0.2913 -0.1068 0.0973 -0.1519 0.5048 -0.2422 -0.2938 -0.0395 -0.1038 -0.1708 0.5279 -0.2437 -0.2856 0.1623 0.1248 0.1629 0.1277 0.1442 0.1414
va: 2.0694 4.5253 1.9842 2.0889 2.0553 4.5634 2.1032 2.0009 3.9110 3.7699 2.0567 4.5433 2.0801 1.9947 4.0291 3.9321 2.0329 4.5284 2.0872 2.0163 1.0053 0.9997 1.0086 1.0051 1.0233 1.0040
dispcorr: -0.048340444 hartree
energy: -1277.959976270075
dipole: -2.70932 2.11871 -0.59061 -3.70037 2.67506 -1.02531 8.41703 -6.30864 2.10839
quadrupole: 1161.53570 -1247.52404 .24914 .89661 .36610 2757.17129 -2854.44127 -0.72759 0.42277 -0.54026 1091.18990 -1176.53296 0.63 0.13 -0.75 571.32007 -572.99035 9 1 7 359.00471 -364.12062 1 7 6 641.73212 -646.09785 7 7 9
magnitude: 2.41772 au
magnitude: 6.14537 debye
zeropoint: 0.16429505 hartree
thermalvibcorrection: 0.01555421 hartree
thermalrotcorrection: 0.00141627 hartree
thermaltrasncorrection: 0.00141627 hartree
thermaltotal: -1277.77729447 hartree
thermalcorr: 0.01838675 hartree
nonthermalcorr: 0.16429505 hartree
totalcorr: 0.18268180 hartree
totalenthalpy: -1277.77635026 hartree
