program: Orca
programVersion: 5.0.4
elementType: O N O O O N O O C C O N O O C C O N O O H H H H H H
charge: 0
multiplicity: 1
keywords: wB97X-D3BJ Opt Freq def2-TZVPP def2/J RIJCOSX VeryTightSCF
keywords: PAL8 TightOpt defgrid3
frequency: 0.00 0.00 0.00 0.00 0.00 0.00 25.38 35.40 49.32 56.33 58.83 67.24 71.13 76.83 89.66 98.81 124.13 155.27 172.72 227.93 243.43 265.24 298.13 323.09 390.65 408.53 454.10 494.11 580.69 611.86 618.85 651.41 676.24 700.08 706.29 740.95 793.72 796.72 799.85 802.48 809.88 850.64 884.38 902.52 918.17 924.98 976.64 998.64 1049.62 1071.90 1107.00 1123.47 1164.05 1180.30 1286.05 1314.85 1338.44 1342.23 1364.18 1379.23 1385.43 1396.85 1420.46 1428.31 1443.11 1449.02 1479.35 1505.59 1782.60 1790.18 1791.49 1807.35 3122.61 3131.55 3138.03 3175.56 3188.42 3200.98
frequency: 25.38 35.40 49.32 56.33 58.83 67.24 71.13 76.83 89.66 98.81 124.13 155.27 172.72 227.93 243.43 265.24 298.13 323.09 390.65 408.53 454.10 494.11 580.69 611.86 618.85 651.41 676.24 700.08 706.29 740.95 793.72 796.72 799.85 802.48 809.88 850.64 884.38 902.52 918.17 924.98 976.64 998.64 1049.62 1071.90 1107.00 1123.47 1164.05 1180.30 1286.05 1314.85 1338.44 1342.23 1364.18 1379.23 1385.43 1396.85 1420.46 1428.31 1443.11 1449.02 1479.35 1505.59 1782.60 1790.18 1791.49 1807.35 3122.61 3131.55 3138.03 3175.56 3188.42 3200.98
formula: C4H6N4O12
InChI: InChI=1S/C4H6N4O12/c9-5(10)17-1-3(19-7(13)14)4(20-8(15)16)2-18-6(11)12/h3-4H,1-2H2
26 atoms
O  2.200039 -0.477747 -1.009003
N  3.577212 -0.74982 -1.042942
O  4.257711 -0.264035 -0.180587
O  3.879831 -1.454523 -1.947621
O  1.371163 2.306907 -1.485228
N  2.005083 2.170942 -2.746461
O  1.290438 2.497728 -3.634177
O  3.133201 1.77445 -2.763182
C  1.817976 2.882336 0.745523
C  2.132089 1.867718 -0.354816
O  2.417915 2.495713 1.987043
N  3.789076 2.79831 2.098256
O  4.254104 2.41878 3.12357
O  4.300719 3.382423 1.185805
C  1.787935 0.427802 0.029597
C  0.32618 0.091104 0.287078
O  -0.500055 0.208842 -0.87581
N  -1.277965 1.36969 -0.96242
O  -1.874821 1.438959 -1.984687
O  -1.26968 2.126294 -0.027941
H  2.153439 3.871271 0.440989
H  0.753939 2.914447 0.968733
H  0.257484 -0.961749 0.558456
H  -0.068618 0.69542 1.100475
H  3.190945 1.919334 -0.594204
H  2.326903 0.193193 0.949032
totalener: -1277.91695753 hartree
nucrepener: 1850.03796484 hartree
electener: -3127.95492237 hartree
oneelecener: -5428.17186269 hartree
twoeener: 2300.21694031 hartree
kineticenergy: 1273.58349055 hartree
exchangeener: -102.823610381352 hartree
correlationener: -6.826867689823 hartree
xcener: -109.650478071175 hartree
temp: 298.15 k
press: 1.00 atm
thermalcorrenthalpy: 0.00094421 hartree
totalenthalpy: -1277.78181221 hartree
totalentropycorr: -0.06502871 hartree
gibbsenthalpy: -1277.84684093 hartree
gibbsminuselec: 0.11889903 hartree
chargesum: -0.0000000
charge: -0.164814 0.515681 -0.295976 -0.237785 -0.204029 0.523624 -0.235075 -0.281033 -0.078325 -0.094998 -0.175046 0.515180 -0.247663 -0.286990 0.131881 -0.137571 -0.151806 0.531472 -0.234402 -0.319609 0.153422 0.151292 0.142124 0.149701 0.188689 0.142056
charge: 0.200814 -0.140674 0.003402 0.045488 0.196918 -0.134814 0.047406 0.018366 -0.090986 -0.189651 0.187139 -0.141208 0.034286 0.013398 -0.181634 -0.089509 0.198213 -0.146200 0.047019 -0.010026 0.019616 0.022904 0.033083 0.013752 0.011589 0.031312
qa: -0.1648 0.5157 -0.2960 -0.2378 -0.2040 0.5236 -0.2351 -0.2810 -0.0783 -0.0950 -0.1750 0.5152 -0.2477 -0.2870 0.1319 -0.1376 -0.1518 0.5315 -0.2344 -0.3196 0.1534 0.1513 0.1421 0.1497 0.1887 0.1421
va: 2.0711 4.5178 1.9944 2.0873 2.0314 4.5331 2.0954 2.0242 3.9299 3.9715 2.0360 4.5225 2.0739 2.0117 3.7784 4.0393 2.0655 4.5222 2.0926 1.9633 1.0043 1.0052 1.0032 0.9972 1.0114 1.0200
dispcorr: -0.048781865 hartree
energy: -1277.965786196262
dipole: -2.52835 1.87994 -0.64841 0.39440 -0.42930 -0.03490 5.92076 -4.55602 1.36475
quadrupole: 2026.40642 -2121.43275 .77045 -0.04591 .63584 1051.80439 -1132.80363 0.53264 -0.50169 -0.68162 1622.99779 -1715.76255 -0.35 -0.86 0.36 -35.29412 39.22482 0 3 2 545.18891 -552.26674 2 8 0 364.27756 -367.58881 9 3 8
magnitude: 1.51135 au
magnitude: 3.84155 debye
zeropoint: 0.16468756 hartree
thermalvibcorrection: 0.01547413 hartree
thermalrotcorrection: 0.00141627 hartree
thermaltrasncorrection: 0.00141627 hartree
thermaltotal: -1277.78279196 hartree
thermalcorr: 0.01830668 hartree
nonthermalcorr: 0.16468756 hartree
totalcorr: 0.18299424 hartree
totalenthalpy: -1277.78184775 hartree
