program: Orca
programVersion: 5.0.4
elementType: O N O O O N O O C C O N O O C C O N O O H H H H H H
charge: 0
multiplicity: 1
keywords: wB97X-D3BJ Opt Freq def2-TZVPP def2/J RIJCOSX VeryTightSCF
keywords: PAL8 TightOpt defgrid3
frequency: 0.00 0.00 0.00 0.00 0.00 0.00 15.35 29.65 40.32 53.85 59.56 67.26 72.48 76.02 87.18 114.80 127.58 140.51 174.14 239.50 242.33 258.86 304.26 316.13 375.15 386.26 460.72 508.81 568.17 592.12 606.40 657.31 683.56 688.56 705.84 738.60 794.85 799.47 800.32 802.12 854.98 867.42 892.32 900.21 918.56 933.85 959.79 1001.36 1039.03 1077.01 1097.21 1121.87 1147.02 1181.89 1289.74 1323.25 1325.45 1352.63 1360.93 1372.73 1378.56 1387.37 1423.79 1431.56 1439.22 1450.21 1475.13 1483.69 1784.29 1792.56 1793.51 1803.53 3108.94 3111.89 3125.50 3152.27 3180.20 3192.95
frequency: 15.35 29.65 40.32 53.85 59.56 67.26 72.48 76.02 87.18 114.80 127.58 140.51 174.14 239.50 242.33 258.86 304.26 316.13 375.15 386.26 460.72 508.81 568.17 592.12 606.40 657.31 683.56 688.56 705.84 738.60 794.85 799.47 800.32 802.12 854.98 867.42 892.32 900.21 918.56 933.85 959.79 1001.36 1039.03 1077.01 1097.21 1121.87 1147.02 1181.89 1289.74 1323.25 1325.45 1352.63 1360.93 1372.73 1378.56 1387.37 1423.79 1431.56 1439.22 1450.21 1475.13 1483.69 1784.29 1792.56 1793.51 1803.53 3108.94 3111.89 3125.50 3152.27 3180.20 3192.95
formula: C4H6N4O12
InChI: InChI=1S/C4H6N4O12/c9-5(10)17-1-3(19-7(13)14)4(20-8(15)16)2-18-6(11)12/h3-4H,1-2H2
26 atoms
O  2.068313 -0.686338 -1.176162
N  1.954097 -2.079336 -1.162974
O  1.389747 -2.579069 -0.225417
O  2.45503 -2.58989 -2.109347
O  1.916348 1.944915 -1.33316
N  3.028146 2.606096 -1.88711
O  2.807737 3.009905 -2.979305
O  4.019306 2.687408 -1.216675
C  1.565543 2.233258 1.076068
C  2.120091 1.353991 -0.042456
O  2.56836 3.071525 1.659659
N  2.743271 4.321212 1.040079
O  3.603147 4.960944 1.550526
O  2.028142 4.585539 0.115008
C  1.445603 -0.020863 -0.066841
C  -0.083242 -0.006571 -0.130448
O  -0.638021 1.076406 -0.878103
N  -0.72909 0.856319 -2.268556
O  -1.119326 1.813494 -2.850395
O  -0.430392 -0.230477 -2.672774
H  0.7193 2.820288 0.724152
H  1.255906 1.613839 1.91897
H  -0.466224 -0.95985 -0.483851
H  -0.472927 0.167313 0.873235
H  3.187192 1.203681 0.11281
H  1.725622 -0.540095 0.851927
totalener: -1277.90909277 hartree
nucrepener: 1833.10127960 hartree
electener: -3111.01037236 hartree
oneelecener: -5394.23733072 hartree
twoeener: 2283.22695836 hartree
kineticenergy: 1273.50803314 hartree
exchangeener: -102.814987528056 hartree
correlationener: -6.825730497123 hartree
xcener: -109.640718025179 hartree
temp: 298.15 k
press: 1.00 atm
thermalcorrenthalpy: 0.00094421 hartree
totalenthalpy: -1277.77376952 hartree
totalentropycorr: -0.06523842 hartree
gibbsenthalpy: -1277.83900794 hartree
gibbsminuselec: 0.11831570 hartree
chargesum: -0.0000000
charge: -0.139676 0.512334 -0.305204 -0.238740 -0.163074 0.501729 -0.233244 -0.291010 -0.105106 0.097150 -0.152246 0.505661 -0.242354 -0.294122 -0.040593 -0.102541 -0.172236 0.527785 -0.244201 -0.283929 0.162641 0.124129 0.161883 0.128015 0.144654 0.142294
charge: 0.207336 -0.139215 -0.003829 0.045732 0.199177 -0.140496 0.049902 0.005311 -0.096409 -0.175370 0.188069 -0.145690 0.038591 0.006560 -0.182130 -0.108889 0.185157 -0.142156 0.042388 0.010759 0.019900 0.029913 0.014491 0.032125 0.025206 0.033564
qa: -0.1397 0.5123 -0.3052 -0.2387 -0.1631 0.5017 -0.2332 -0.2910 -0.1051 0.0972 -0.1522 0.5057 -0.2424 -0.2941 -0.0406 -0.1025 -0.1722 0.5278 -0.2442 -0.2839 0.1626 0.1241 0.1619 0.1280 0.1447 0.1423
va: 2.0690 4.5270 1.9834 2.0887 2.0539 4.5636 2.1039 2.0019 3.9079 3.7706 2.0563 4.5426 2.0802 1.9949 4.0247 3.9330 2.0316 4.5298 2.0866 2.0182 1.0060 0.9998 1.0090 1.0052 1.0230 1.0035
dispcorr: -0.048369783 hartree
energy: -1277.959971712838
dipole: -3.63052 2.80083 -0.82970 -3.39457 2.44057 -0.95399 8.17192 -6.11795 2.05397
quadrupole: 1190.89428 -1276.40293 .27655 .88687 .37010 2679.51334 -2776.48918 -0.65810 0.45542 -0.59958 1124.05039 -1210.07159 0.70 0.07 -0.70 623.01561 -625.08227 0 7 9 396.29000 -401.59116 3 7 6 618.62793 -622.48750 0 6 0
magnitude: 2.41191 au
magnitude: 6.13059 debye
zeropoint: 0.16430250 hartree
thermalvibcorrection: 0.01554843 hartree
thermalrotcorrection: 0.00141627 hartree
thermaltrasncorrection: 0.00141627 hartree
thermaltotal: -1277.77728825 hartree
thermalcorr: 0.01838097 hartree
nonthermalcorr: 0.16430250 hartree
totalcorr: 0.18268347 hartree
totalenthalpy: -1277.77634404 hartree
