program: Orca
programVersion: 5.0.4
elementType: O C C N O O O C C O N O O H H H H H H H H
charge: 0
multiplicity: 1
keywords: wB97X-D3BJ Opt Freq def2-TZVPP def2/J RIJCOSX VeryTightSCF
keywords: PAL8 TightOpt defgrid3
frequency: 0.00 0.00 0.00 0.00 0.00 0.00 25.05 35.37 57.78 68.18 89.34 108.42 116.20 176.03 192.64 308.81 382.48 397.88 432.30 504.28 514.71 608.64 612.63 686.15 702.45 801.32 806.55 831.97 894.32 900.65 928.71 943.69 947.91 1051.38 1077.05 1086.45 1124.03 1164.72 1191.86 1307.76 1312.60 1315.33 1345.61 1359.56 1370.07 1410.22 1430.99 1435.59 1440.60 1481.10 1486.91 1492.96 1507.96 1767.57 1775.05 3032.17 3059.55 3112.01 3115.08 3128.89 3155.18 3169.95 3178.32
frequency: 25.05 35.37 57.78 68.18 89.34 108.42 116.20 176.03 192.64 308.81 382.48 397.88 432.30 504.28 514.71 608.64 612.63 686.15 702.45 801.32 806.55 831.97 894.32 900.65 928.71 943.69 947.91 1051.38 1077.05 1086.45 1124.03 1164.72 1191.86 1307.76 1312.60 1315.33 1345.61 1359.56 1370.07 1410.22 1430.99 1435.59 1440.60 1481.10 1486.91 1492.96 1507.96 1767.57 1775.05 3032.17 3059.55 3112.01 3115.08 3128.89 3155.18 3169.95 3178.32
formula: C4H8N2O7
InChI: InChI=1S/C4H8N2O7/c7-5(8)12-3-1-11-2-4-13-6(9)10/h1-4H2
21 atoms
O  -0.066139 0.063913 0.079095
C  1.37228 0.048979 0.015207
C  1.970003 1.441592 -0.075951
N  -0.587563 0.364786 1.330767
O  1.525932 2.143498 -1.220748
O  -1.778334 0.409643 1.339561
O  0.186201 0.53208 2.236327
C  2.223234 1.856795 -2.411448
C  3.541415 2.606825 -2.517624
O  3.313017 4.025802 -2.518546
N  3.338015 4.635559 -1.264418
O  2.96081 5.764338 -1.298728
O  3.74719 4.00033 -0.33092
H  1.779157 -0.49201 0.869143
H  1.5560 -0.526012 -0.892541
H  1.678245 2.037552 0.787439
H  3.062267 1.351336 -0.053325
H  2.423821 0.782918 -2.525002
H  1.568261 2.16338 -3.228375
H  4.244455 2.34867 -1.728643
H  4.00605 2.413102 -3.485332
totalener: -793.50251209 hartree
nucrepener: 863.92829595 hartree
electener: -1657.43080804 hartree
oneelecener: -2800.09222381 hartree
twoeener: 1142.66141577 hartree
kineticenergy: 790.59197987 hartree
exchangeener: -65.105743387363 hartree
correlationener: -4.439086815132 hartree
xcener: -69.544830202494 hartree
temp: 298.15 k
press: 1.00 atm
thermalcorrenthalpy: 0.00094421 hartree
totalenthalpy: -793.36571926 hartree
totalentropycorr: -0.05288003 hartree
gibbsenthalpy: -793.41859929 hartree
gibbsminuselec: 0.11540828 hartree
chargesum: 0.0000000
charge: -0.151251 -0.042720 -0.023941 0.504164 -0.295134 -0.263197 -0.307230 0.012562 -0.069825 -0.160212 0.520554 -0.259738 -0.311098 0.128844 0.106229 0.127264 0.075372 0.060924 0.107816 0.119861 0.120755
charge: 0.194130 -0.105865 -0.134327 -0.146167 0.232451 0.016907 -0.009772 -0.135447 -0.105072 0.191988 -0.143565 0.021509 -0.004669 0.013164 0.017762 0.021262 0.015544 0.011471 0.024139 0.000359 0.024200
qa: -0.1513 -0.0427 -0.0239 0.5042 -0.2951 -0.2632 -0.3072 0.0126 -0.0698 -0.1602 0.5206 -0.2597 -0.3111 0.1288 0.1062 0.1273 0.0754 0.0609 0.1078 0.1199 0.1208
va: 2.0582 3.9440 3.9149 4.5553 2.0050 2.0558 1.9815 3.9485 3.9161 2.0504 4.5535 2.0600 1.9798 1.0087 0.9960 1.0063 0.9991 0.9992 0.9981 1.0054 1.0034
dispcorr: -0.031559645 hartree
energy: -793.536043262613
dipole: 6.53367 -5.02599 1.50768 -6.69116 5.20038 -1.49077 -5.88781 4.70396 -1.18385
quadrupole: 1072.01397 -1132.25842 .67477 .70908 -0.20465 1262.93605 -1322.87737 0.55032 -0.29866 0.77971 836.33720 -891.90319 -0.49 0.63 0.59 899.04010 -905.34236 1 8 1 -714.27903 714.30246 7 7 7 -605.33634 608.57784 6 6 5
magnitude: 2.42838 au
magnitude: 6.17244 debye
zeropoint: 0.15482655 hartree
thermalvibcorrection: 0.00974351 hartree
thermalrotcorrection: 0.00141627 hartree
thermaltrasncorrection: 0.00141627 hartree
thermaltotal: -793.36864066 hartree
thermalcorr: 0.01257605 hartree
nonthermalcorr: 0.15482655 hartree
totalcorr: 0.16740260 hartree
totalenthalpy: -793.36769645 hartree
