program: Gaussian 09
title: 000002278
version: EM64L-G09RevD.01
frameworkgroup: C1[X(C14H11NO6)]
method: RPBEPBE
basis: SDD
operation: Freq
keyword: #p
keyword: freq=noraman
keyword: PBEPBE/SDD
title: #p freq=noraman PBEPBE/SDD
converged: YES YES NO NO
title: Mulliken charges:
elementType: O O O O O O N C C C C C C C C C C C C C C H H H H H H H H H H H
charge: -0.332566 -0.171482 -0.385943 -0.198523 -0.155192 -0.134674 0.196276 0.488054 0.406826 -0.546199 -0.461737 -0.386861 -0.326107 0.110015 -0.203917 0.170601 0.195712 -0.288136 -0.392582 -0.246468 -0.191422 0.257594 0.243370 0.242452 0.237964 0.310506 0.233556 0.273970 0.222740 0.236945 0.235393 0.359835
chargesum: 0.00000
title: Mulliken charges with hydrogens summed into heavy atoms:
elementType: O O O O O O N C C C C C C C C C C C C C C
charge: -0.332566 -0.171482 -0.026108 -0.198523 -0.155192 -0.134674 0.196276 0.488054 0.406826 -0.288605 0.024085 -0.148897 -0.015600 0.110015 0.029638 0.170601 0.195712 -0.014166 -0.169842 -0.009523 0.043970
polarizability: 2.98389652e+02 6.69631567e-01 2.07554744e+02 -3.53134931e+00 6.84603465e+00 9.56446917e+01
1716.lowfreq: -2.9166 -0.0006 0.0001 0.0004 2.7863 8.6705 11.8460 14.0217 25.6126
frequency: 11.3691 13.8975 25.6056 35.0381 49.1709 75.8353 78.1899 126.2805 134.3922 183.5456 210.9941 225.1843 228.4071 254.2999 261.9401 300.0159 373.1166 404.8675 413.5779 431.3117 440.3516 447.5588 490.3692 522.1749 532.8649 552.2580 578.8944 587.0225 635.9596 641.5245 657.3752 666.5019 697.6420 741.3261 752.0000 755.0948 763.2396 767.9492 804.1190 819.1200 854.0175 877.3107 908.2033 921.4462 933.9124 959.1486 968.5619 985.4733 990.8809 994.2593 1007.9302 1042.2988 1090.5963 1098.9181 1137.2010 1159.7401 1161.7449 1176.1123 1176.6178 1187.3961 1212.3730 1244.7687 1255.6453 1294.7233 1299.6934 1337.9003 1387.0119 1396.0312 1430.7596 1440.5381 1468.0780 1475.7062 1488.5019 1508.5359 1585.3943 1593.5891 1608.4784 1619.3848 1647.2102 3020.0851 3090.0721 3115.0453 3135.2846 3146.4636 3153.2966 3159.3079 3166.6983 3193.2928 3216.6714 3549.5641
redmass: 5.6696 8.4330 9.3277 13.2620 6.3081 6.6631 6.1441 5.1843 7.8270 6.8586 4.7884 6.5384 4.9451 5.5403 5.6702 5.0295 4.5299 1.2273 4.8565 3.0155 3.8346 4.4999 5.5418 3.3933 7.5956 7.7357 6.8705 6.4404 7.0664 13.9888 6.4643 4.6947 2.4115 6.1313 13.0706 2.7480 5.7726 1.7619 1.5001 6.0896 1.4994 2.8575 2.4992 1.9116 1.9259 1.3639 2.3876 4.7608 1.3418 1.3325 3.1786 2.2311 1.9344 1.6274 2.0268 1.6412 3.1904 1.0662 1.0876 1.1608 3.4846 2.9478 2.9047 1.4443 1.3087 1.3940 8.9084 7.1516 2.3745 2.8766 1.1110 2.6377 2.5431 12.5579 6.4797 6.4452 6.6160 6.6481 11.6215 1.0567 1.1091 1.0891 1.0882 1.0900 1.0926 1.0964 1.0959 1.0957 1.0946 1.0658
irintensity: 0.1180 1.2309 4.1633 0.0225 0.6423 0.5326 1.4468 0.2431 1.2211 0.6954 0.3330 2.4181 0.9203 0.2187 0.9536 5.5793 1.8920 116.4258 10.5615 18.4460 1.0980 11.7580 5.2691 16.8123 2.2511 4.1047 26.3940 5.9065 29.8826 6.0939 12.5079 13.8542 25.9806 3.1540 299.0940 44.5039 30.3345 42.5485 66.1508 87.2758 0.7480 37.1369 12.5923 8.1844 3.0495 2.2158 200.3307 12.9170 0.5347 3.3696 324.3789 2.6929 62.9015 65.4488 335.3224 254.6064 136.6075 22.6874 2.7619 16.2052 510.1463 4.4065 21.3663 55.1616 2.3482 13.1415 4.5647 18.7881 29.7843 90.3797 9.9230 47.1848 21.9360 232.9562 69.7616 23.1345 38.9562 11.5006 222.6406 13.4801 10.9017 12.6443 5.3447 9.4693 8.1757 13.9649 16.6699 5.7382 6.3751 34.9031
temp: 298.150 k
press: 1.00000 atm
elementType: 8 8 8 8 8 8 7 6 6 6 6 6 6 6 6 6 6 6 6 6 6 1 1 1 1 1 1 1 1 1 1 1
symmnumber: 1
zpe: 595514.6 jmol-1
zpe.correction: 0.226820 hartree
zpe.thermalcorrener: 0.245562 hartree
zpe.thermalcorrenthalpy: 0.246506 hartree
zpe.thermalcorrgfe: 0.174901 hartree
zpe.sumelectzpe: -1044.560133 hartree
zpe.sumelectthermal: -1044.541390 hartree
zpe.sumelectthermalent: -1044.540446 hartree
zpe.sumelectthermalfe: -1044.612051 hartree
dipole: -5.2850 -0.4419 -1.9230
dipole: 5.6413
quadrupole: -103.2413 -113.5024 -127.0314
quadrupole: 22.8489 -6.6613 2.4483
quadrupole: 11.3504 1.0893 -12.4397 22.8489 -6.6613 2.4483
hfenergy: -1044.7869521 hartree
pointgroup: C01 [X(C14H11N1O6)]
dipole: -2.132089 0.308929 -0.5335859 debye
polarizability: 296.3886127|0.7158248|178.416269|-17.9358386|49.9280187|126.784206 unknown
InChI: InChI=1S/C14H11NO6/c16-13-7-2-1-6-12(13)14(17)21-11-5-3-4-10(8-11)9-20-15(18)19/h1-8,16H,9H2
charge 0 multiplicity 1
32 atoms
O  -0.919175 0.414213 0.000733
O  4.321473 -0.892683 -0.374156
O  -4.922223 1.445682 1.098191
O  -2.22748 1.821073 1.366102
O  5.800186 -1.231839 -2.211295
O  5.879182 -2.605816 -0.373582
N  5.444706 -1.646117 -1.061669
C  2.711429 0.883599 -0.399253
C  0.350561 1.004706 0.24195
C  1.383308 0.420442 -0.525307
C  3.811845 0.254665 -1.216069
C  2.999372 1.938126 0.504517
C  0.624797 2.062205 1.144469
C  -3.251118 -0.040934 0.132982
C  1.959577 2.514381 1.262319
C  -2.149575 0.847152 0.591316
C  -4.619055 0.270143 0.413367
C  -2.970873 -1.239048 -0.584517
C  -5.650392 -0.604725 -0.015765
C  -3.994105 -2.106149 -1.006434
C  -5.34231 -1.784331 -0.718207
H  1.133046 -0.395197 -1.211655
H  3.453811 -0.153805 -2.176768
H  4.650579 0.947333 -1.402305
H  4.028098 2.299851 0.612033
H  -0.176315 2.516883 1.726379
H  2.179501 3.331274 1.957638
H  -1.925746 -1.472943 -0.797385
H  -6.696275 -0.353554 0.204671
H  -3.748091 -3.022512 -1.551172
H  -6.15102 -2.449326 -1.039745
H  -5.903017 1.538651 1.209115
