program: Gaussian 16
title: Title
version: ES64L-G16RevA.03
method: RPBE1PBE
basis: def2SVP
operation: Freq
keyword: #N
keyword: Geom=AllCheck
keyword: Guess=TCheck
keyword: SCRF=Check
keyword: GenChk
keyword: RPBE1PBE/def2SVP
keyword: Freq
converged: YES YES NO YES
title: Mulliken charges:
elementType: Pd P P C H C H C H C H H H H H C C C C H C H C H H H C C C C H C H C H H H C C C C H C H C H H H C C C C H C H C H H H N C C C C C C C C C C C C C H H H H H H H H H H H H H H H H H H H
charge: -0.165960 0.190553 0.206287 -0.161457 0.048618 -0.170788 0.093688 -0.027658 0.068984 -0.036220 0.076512 0.048508 0.050574 0.052805 0.096803 -0.159234 -0.038106 -0.012629 -0.024383 0.088309 -0.029692 0.038758 -0.024936 0.035736 0.038861 0.041528 -0.126646 -0.005512 -0.051452 -0.027650 0.009867 -0.021305 0.031087 -0.032732 0.034491 0.037004 0.038076 -0.132576 -0.030638 -0.019159 -0.020895 0.031292 -0.029403 0.052754 -0.034659 0.034416 0.034847 0.036759 -0.158733 -0.009510 -0.022356 -0.026953 0.040719 -0.027290 0.043813 -0.024317 0.038762 0.036070 0.041208 -0.402033 0.183785 0.035527 0.037735 -0.106039 -0.096653 -0.090075 -0.203546 0.060281 -0.055210 -0.037094 -0.038064 -0.036308 -0.048659 0.019367 0.029928 0.034422 0.009407 0.008647 0.030326 0.051551 0.043899 0.057975 0.103483 0.040741 0.093913 0.049607 0.036238 0.046196 0.009953 0.020213 0.021578 0.024067
chargesum: -0.00000
title: Mulliken charges with hydrogens summed into heavy atoms:
elementType: Pd P P C C C C C C C C C C C C C C C C C C C C C C C C C C C C N C C C C C C C C C C C C C
charge: -0.165960 0.190553 0.206287 0.001215 0.002527 0.069468 0.067160 -0.159234 0.050203 0.026129 0.011353 0.009169 0.016592 -0.126646 0.004356 -0.020365 0.006842 0.015699 0.005344 -0.132576 0.000654 0.033595 0.013520 0.005444 0.002100 -0.158733 0.031209 0.021457 0.011809 0.008779 0.016891 -0.402033 0.233079 0.079356 0.076708 -0.054488 0.108704 0.094187 -0.167309 0.060281 -0.009014 -0.027141 -0.017851 -0.014730 -0.024592
1716.lowfreq: -6.9531 -0.0017 -0.0013 -0.0009 4.1432 6.1564 13.0425 20.2739 25.2991
redmass: 5.1331 4.6932 3.7081 5.0426 4.3401 5.0510 4.3844 3.8474 5.1413 4.8707 4.3870 4.7516 3.6544 4.1083 4.0338 4.1501 3.9053 4.6085 6.7631 5.4861 5.6734 3.8540 4.1239 2.9962 2.6682 2.5021 2.3173 3.2448 4.5858 6.3607 4.5432 5.0425 3.2551 2.9482 2.1008 3.1508 2.7822 1.6433 3.4924 3.7311 2.9581 3.2968 2.5669 3.4373 2.5421 3.4537 3.1933 3.6759 2.4810 2.8338 2.8244 2.9441 3.6586 3.8514 2.9757 3.1653 5.9533 5.6254 6.2758 3.1746 3.1486 3.2341 2.3571 3.7315 3.8105 3.1995 4.2256 3.5046 4.0477 6.3259 6.2792 6.3540 6.3249 6.2176 2.6627 4.0013 4.2929 3.6156 3.1588 2.2046 1.8437 1.8536 3.2707 1.7854 1.6661 2.0123 1.8773 1.9779 1.8600 1.9642 1.9670 1.9083 1.1886 2.4373 1.1547 2.1193 1.3217 1.2579 1.2565 1.3027 1.5124 1.2563 2.0281 1.3500 1.7954 1.7412 1.4976 1.3842 1.3858 1.3718 1.3564 1.9515 1.5785 1.3828 1.4316 1.8549 1.3895 1.9511 4.4393 5.6190 5.3648 5.5379 1.4118 1.3646 2.5998 1.3224 1.3220 1.3570 1.3299 2.1891 2.3862 2.4453 2.1061 2.4328 2.4978 2.4548 2.0028 1.4597 1.4854 1.4980 1.4851 1.4930 2.2340 1.7147 1.6960 2.9257 2.8637 2.3202 2.5224 1.2295 1.0634 1.0679 1.0787 1.0704 1.4846 1.2175 1.4331 1.1496 1.1245 1.1379 1.4820 1.1626 1.1192 1.2475 1.8081 1.4419 1.4432 2.5170 1.3068 1.2939 1.5500 1.1901 1.3723 1.3857 1.3481 1.3567 1.3561 1.3403 1.2328 1.2788 1.3702 1.3355 1.3668 1.6303 5.1473 5.4508 6.7860 6.4289 3.7238 1.7624 1.1305 1.3476 1.1841 1.0816 1.0839 1.0572 1.0739 1.0956 1.0663 1.0639 2.3668 2.3845 2.3906 2.4182 1.1067 2.5540 1.1305 2.3438 2.3009 2.2865 2.2648 2.4855 3.7690 6.1472 6.0976 6.1537 6.2903 6.3362 6.2693 6.3478 6.2837 6.2985 6.4073 1.0735 1.0733 1.0652 1.0383 1.0635 1.0377 1.0614 1.0639 1.0891 1.0629 1.0893 1.0988 1.1018 1.1029 1.1051 1.1045 1.1021 1.0921 1.1031 1.1030 1.0875 1.1029 1.0889 1.0856 1.0898 1.0892 1.0879 1.0893 1.0893 1.0862 1.0877 1.0909 1.0939 1.0917 1.0906 1.0930 1.0959 1.0948 1.0963 1.0994 1.0955 1.0943 1.1006 1.1008 1.0999 1.0964 1.0962
irintensity: 0.0495 0.0749 0.1671 0.1707 0.1524 0.2589 0.0336 0.2029 0.0912 0.1263 0.1955 0.1097 0.1802 0.4945 0.1722 0.2332 0.2222 0.5381 2.9227 2.5832 1.2213 0.1026 0.0794 0.2487 0.1289 0.5625 0.7789 0.7958 0.8284 3.3905 3.7749 4.0798 2.7492 2.1544 0.9197 0.8491 0.6541 2.2117 0.8537 0.5976 0.7022 3.7518 18.5460 5.6458 0.6496 19.3893 2.6845 11.2261 29.7780 0.5159 0.3588 3.0556 26.8058 37.4230 2.7081 3.9386 21.5557 11.6848 53.3035 1.2836 6.3983 37.5788 15.6813 125.8575 134.3808 17.0313 15.7100 23.1045 3.2059 0.9563 0.1377 0.4896 0.2987 0.6964 28.8722 41.2975 13.2794 27.2252 65.0705 48.8398 4.7364 55.0771 18.2453 65.3815 52.6458 67.5784 49.4022 6.3503 10.6894 14.7862 27.8653 46.6462 0.6203 39.9320 2.8369 2.3648 1.8342 0.6912 1.0925 2.8685 2.6883 0.5519 50.3138 9.2960 56.6740 15.8650 10.0388 1.9080 2.4364 3.3093 1.7482 4.5553 6.8319 0.5298 1.7916 11.2592 0.5041 1.0006 2.0006 1.7817 0.5290 1.5041 0.5077 0.1097 2.4295 0.0343 0.1224 0.6559 0.1718 0.4674 9.0192 6.9427 9.4480 12.3754 9.0956 14.2555 7.7039 6.7611 9.2876 12.6253 14.4443 3.3430 8.9948 2.3092 38.9633 35.7165 29.5163 17.9815 13.3604 46.8283 0.4062 0.4186 1.2369 0.1549 21.8382 8.3263 16.5619 5.1840 2.1168 11.3454 15.0736 0.8023 0.7105 4.3404 11.9723 3.6440 49.2662 120.3323 17.5726 0.7068 13.1878 5.2674 9.2474 7.4350 58.0657 2.6243 3.6214 11.2915 15.2096 28.0234 4.0774 18.3359 14.7341 15.8893 0.9995 1.7963 4.0672 2.3805 18.4598 93.4473 13.2647 1.6415 3.2609 12.7636 27.7770 3.3370 6.1867 11.7572 7.2558 21.6483 27.8603 41.5106 30.1703 14.8362 1.0839 10.6029 16.5501 11.5447 7.6658 29.2451 18.4038 27.7298 86.4413 4.7357 0.6484 1.9501 6.6564 2.7349 4.0683 3.4283 19.9437 5.7263 80.2919 102.2183 354.4702 103.8996 19.2903 39.4960 27.0414 24.8242 17.5652 31.6804 16.5345 56.5294 30.3902 22.8037 39.0687 21.5883 17.3101 19.7542 24.1470 37.0428 47.0192 25.3068 19.7928 1.8563 5.0584 8.3610 1.6669 0.1324 6.6180 0.2489 1.6805 0.5668 0.9751 20.7268 0.2155 9.3683 9.4115 17.2798 18.5490 18.0319 17.4622 18.1575 14.7173 26.7130 26.7296 17.4672 12.4092 8.7813
temp: 298.150 k
press: 1.00000 atm
elementType: 46 15 15 6 1 6 1 6 1 6 1 1 1 1 1 6 6 6 6 1 6 1 6 1 1 1 6 6 6 6 1 6 1 6 1 1 1 6 6 6 6 1 6 1 6 1 1 1 6 6 6 6 1 6 1 6 1 1 1 7 6 6 6 6 6 6 6 6 6 6 6 6 6 1 1 1 1 1 1 1 1 1 1 1 1 1 1 1 1 1 1 1
symmnumber: 1
zpe: 2045990.5 jmol-1
zpe.correction: 0.779277 hartree
zpe.thermalcorrener: 0.823910 hartree
zpe.thermalcorrenthalpy: 0.824854 hartree
zpe.thermalcorrgfe: 0.697983 hartree
zpe.sumelectzpe: -2451.849348 hartree
zpe.sumelectthermal: -2451.804715 hartree
zpe.sumelectthermalent: -2451.803771 hartree
zpe.sumelectthermalfe: -2451.930642 hartree
dipole: 0.5379 -3.7883 -3.1332
dipole: 4.9455
quadrupole: -268.6233 -284.1022 -283.7990
quadrupole: -0.1819 2.2651 -11.6205
quadrupole: 10.2182 -5.2607 -4.9575 -0.1819 2.2651 -11.6205
hfenergy: -2452.6286247 hartree
pointgroup: C01 [X(C41H47N1P2Pd1)]
dipole: 0.033185 -1.5759389 -1.1406501 debye
polarizability: 797.4392918|-36.5519268|829.4070668|4.2899582|-82.4761952|639.7563308 unknown
InChI: InChI=1S/C28H28P2.C13H19N.Pd/c1-5-15-25(16-6-1)29(26-17-7-2-8-18-26)23-13-14-24-30(27-19-9-3-10-20-27)28-21-11-4-12-22-28;1-3-14(4-2)12-8-11-13-9-6-5-7-10-13;/h1-12,15-22H,13-14,23-24H2;5-11H,3-4,12H2,1-2H3;
charge 0 multiplicity 1
92 atoms
Pd -0.08055722 0.28600547 0.34411809
P  1.76181868 -0.2467239 -0.93860644
P  -1.91697148 -0.26162735 -0.96297441
C  1.38210867 -0.52070921 -2.72834723
H  0.20123415 -2.16911364 -1.95419765
C  -1.72125864 -0.08487459 -2.79820804
H  0.97833063 0.42749843 -3.11389052
C  0.36731971 -1.65411202 -2.91445854
H  2.3183791 -0.70753722 -3.27669806
C  -0.98273622 -1.23082868 -3.49196027
H  -2.72005138 0.01277128 -3.25276536
H  0.79429054 -2.42135304 -3.57815968
H  -0.84756168 -0.93884821 -4.5475609
H  -1.6404815 -2.11529495 -3.50479798
H  -1.20336647 0.87519118 -2.95771961
C  2.79717685 -1.70885121 -0.54520036
C  2.35183915 -2.5890169 0.44780435
C  3.99433425 -1.98434309 -1.22033516
C  3.08645076 -3.73551402 0.75539281
H  1.44556098 -2.34182476 1.00869506
C  4.7304945 -3.12456504 -0.90793691
H  4.35880107 -1.2978885 -1.99000815
C  4.27472569 -4.00387151 0.07817411
H  2.73191226 -4.41508882 1.53430467
H  5.66517779 -3.33080361 -1.43522264
H  4.85377639 -4.89829346 0.32098429
C  2.97228057 1.12986342 -0.99522514
C  3.90453268 1.27292197 0.0432362
C  2.89733346 2.13711902 -1.9680081
C  4.73830475 2.3867065 0.10699078
H  3.9740579 0.50420186 0.81409337
C  3.73144051 3.25325787 -1.90286528
H  2.17451283 2.06915209 -2.78289445
C  4.65391373 3.38441635 -0.86571261
H  5.45802883 2.47609812 0.92452098
H  3.65614157 4.02679079 -2.67119397
H  5.30492233 4.26030096 -0.81475076
C  -3.40371296 0.74699497 -0.60241638
C  -3.8706851 1.76181839 -1.44375752
C  -4.03102084 0.55813386 0.64000897
C  -4.95090405 2.56013207 -1.05981791
H  -3.39090715 1.94964206 -2.40617238
C  -5.11160629 1.34750241 1.01797931
H  -3.66290663 -0.21749777 1.31804886
C  -5.5763046 2.35519948 0.1669166
H  -5.29991509 3.35135877 -1.72791576
H  -5.59317507 1.18107437 1.98477705
H  -6.4214522 2.98000084 0.46537814
C  -2.59187324 -1.96842689 -0.84322563
C  -3.88818128 -2.27736501 -1.2774468
C  -1.77680388 -2.99649828 -0.35601183
C  -4.35715517 -3.58836352 -1.22219522
H  -4.53806473 -1.48403044 -1.65646629
C  -2.2438899 -4.30956159 -0.30278539
H  -0.76623033 -2.76049942 -0.01298032
C  -3.5357747 -4.60705285 -0.73467488
H  -5.37037539 -3.81737255 -1.56156528
H  -1.59596373 -5.10089288 0.08176048
H  -3.90586407 -5.6342149 -0.69019642
N  1.04004297 -0.95808969 3.273359
C  0.67721261 0.45275463 3.40559605
C  -0.00500898 -1.8745603 3.69349559
C  2.30384162 -1.29408372 3.89791334
C  0.61991501 1.29155233 2.13951766
C  -1.32900529 -1.68995901 2.97722902
C  3.50558415 -0.62398288 3.26286194
C  -0.61072775 1.85345978 1.74715756
C  -0.74844843 3.03035059 0.87285655
C  0.34225437 3.58288289 0.16925854
C  -2.00414452 3.64161629 0.71007192
C  0.17657645 4.68549678 -0.66242941
C  -2.16777795 4.74739357 -0.1214553
C  -1.08031604 5.27804259 -0.81591872
H  -0.30595452 0.52360437 3.89928949
H  1.37929896 0.93963911 4.10782252
H  0.36431978 -2.89547752 3.49731628
H  -0.17468111 -1.82131241 4.79581193
H  2.2856401 -1.06533474 4.99009519
H  2.43062621 -2.38699808 3.82268771
H  1.5512071 1.80513474 1.87283918
H  -1.99926852 -2.53637045 3.18978699
H  -1.84999754 -0.77149344 3.28484926
H  -1.17439587 -1.62703558 1.88927119
H  4.42387231 -0.89156076 3.80683209
H  3.6160847 -0.95051189 2.21912535
H  3.42170875 0.47343714 3.27425137
H  -1.5041612 1.61339139 2.33558696
H  1.33118717 3.12843624 0.2587176
H  -2.86910458 3.22444963 1.23225
H  1.04126945 5.08327427 -1.20099015
H  -3.16017872 5.19212997 -0.23332634
H  -1.20899503 6.14274045 -1.47157027
