program: Gaussian 09
title: 000046216
version: EM64L-G09RevD.01
frameworkgroup: C1[X(C12H19NO)]
method: RPBEPBE
basis: SDD
operation: Freq
keyword: #p
keyword: freq=noraman
keyword: PBEPBE/SDD
title: #p freq=noraman PBEPBE/SDD
converged: YES YES NO NO
title: Mulliken charges:
elementType: O N C C C C C C C C C C C C H H H H H H H H H H H H H H H H H H H
charge: -0.462779 -0.314958 -0.064061 -0.228792 -0.319771 -0.722447 0.406493 -0.386234 -0.388612 -0.402520 -0.679252 -0.238776 -0.221815 -0.244759 0.165926 0.189435 0.233968 0.217386 0.169249 0.239187 0.246838 0.213098 0.219233 0.183162 0.265703 0.283656 0.337291 0.211606 0.220427 0.208155 0.220435 0.220791 0.222737
chargesum: 0.00000
title: Mulliken charges with hydrogens summed into heavy atoms:
elementType: O N C C C C C C C C C C C C
charge: -0.125488 -0.080990 0.101865 -0.039357 0.066865 -0.023324 0.406493 0.016161 -0.122909 -0.118863 -0.039064 -0.018341 -0.001024 -0.022022
polarizability: 1.71596348e+02 4.55488335e+00 1.44607445e+02 -1.29502614e+01 4.65919117e-01 9.67452423e+01
1716.lowfreq: -7.4154 0.0003 0.0004 0.0007 6.7526 8.3251 24.9835 41.9682 68.2569
frequency: 24.4617 41.8640 68.1672 92.5739 97.6092 114.3767 156.4237 198.4681 222.1425 234.0966 244.9069 257.9473 282.0309 305.0735 317.5354 402.8676 412.5993 424.7811 459.8208 537.6928 560.2445 617.2890 649.2052 704.9758 707.5720 746.7500 760.4989 806.9705 854.1879 860.1645 888.0286 904.7202 925.8364 941.5159 980.8011 991.8782 995.4923 998.3743 1028.6144 1039.7958 1056.5577 1077.9049 1086.5664 1093.5506 1131.1262 1148.2368 1160.7655 1170.4327 1176.0102 1189.8680 1218.1911 1231.1294 1274.1863 1282.7022 1290.6601 1313.7469 1323.3553 1338.8425 1368.7939 1381.8630 1385.1656 1392.0581 1397.2275 1435.9786 1465.2494 1470.9944 1474.5828 1478.5919 1479.6227 1483.5164 1485.2805 1496.7487 1591.4895 1615.5802 2760.4707 2845.2289 2893.4746 2965.5854 2976.8667 2993.1200 3019.0369 3037.8968 3073.2049 3078.1634 3086.7947 3101.6893 3118.1770 3130.0701 3146.0192 3157.8859 3178.3463 3387.1738 3561.9139
redmass: 3.8461 3.8767 1.7109 3.3237 2.5844 3.5540 2.5658 3.7463 1.1151 3.9616 2.2404 1.3834 1.2183 2.6701 3.1550 2.8899 4.3914 3.1068 3.2278 3.2018 3.7374 6.4080 3.5850 1.8472 1.4340 2.0471 1.0854 2.8704 2.3960 1.2619 1.2326 1.6500 1.5771 1.8758 1.5488 4.1709 4.5497 1.3241 2.2711 2.7307 1.5978 2.0457 1.7817 1.9738 1.7284 1.3953 2.7051 1.0622 2.3187 1.1468 1.4632 1.2744 1.4592 1.1016 1.1654 1.3660 1.3055 1.3911 1.4841 3.0780 1.6458 1.2613 1.4905 2.2087 1.2584 1.0660 1.0588 1.0437 1.0708 1.0706 2.1895 1.0871 6.2817 6.0229 1.0798 1.0717 1.0829 1.0644 1.0362 1.0357 1.0855 1.0972 1.1007 1.0992 1.0993 1.1003 1.0845 1.0893 1.0940 1.0988 1.0949 1.0732 1.0657
irintensity: 0.2113 0.1999 0.6093 1.3292 1.4740 0.9889 0.6939 0.5926 0.0687 1.9665 31.3816 1.4773 110.4207 10.8438 26.3956 0.9966 1.1605 5.0758 2.1280 32.0984 0.4789 0.2177 15.9801 42.1062 79.5350 62.8120 5.8908 6.8403 6.6482 1.6452 5.6682 3.9593 13.0134 3.6055 2.5020 0.4717 52.4332 1.7830 7.2119 12.4789 6.1536 4.2179 7.7206 12.4304 0.5393 73.8890 47.9094 1.7330 24.3465 5.4454 7.3391 9.0459 4.1788 7.3874 1.4329 5.9978 4.4619 25.3968 1.4045 12.2762 17.9191 21.9958 5.3717 10.8410 34.5158 4.0616 11.9558 14.5431 9.9431 5.4713 19.4370 9.1399 0.2697 6.9711 151.6426 124.1006 67.0689 35.1123 36.5412 15.7342 18.1902 20.8016 75.1483 45.8443 33.6469 21.1055 0.0580 19.4368 22.7802 27.7065 6.9828 3.9876 3.3075
temp: 298.150 k
press: 1.00000 atm
elementType: 8 7 6 6 6 6 6 6 6 6 6 6 6 6 1 1 1 1 1 1 1 1 1 1 1 1 1 1 1 1 1 1 1
symmnumber: 1
zpe: 749676.0 jmol-1
zpe.correction: 0.285537 hartree
zpe.thermalcorrener: 0.300820 hartree
zpe.thermalcorrenthalpy: 0.301764 hartree
zpe.thermalcorrgfe: 0.242235 hartree
zpe.sumelectzpe: -597.538249 hartree
zpe.sumelectthermal: -597.522966 hartree
zpe.sumelectthermalent: -597.522021 hartree
zpe.sumelectthermalfe: -597.581551 hartree
dipole: 3.0624 0.8025 -0.5109
dipole: 3.2068
quadrupole: -83.7310 -80.0645 -86.6963
quadrupole: 4.1672 -4.4735 -1.4054
quadrupole: -0.2337 3.4327 -3.1990 4.1672 -4.4735 -1.4054
hfenergy: -597.8237859 hartree
pointgroup: C01 [X(C12H19N1O1)]
dipole: -1.2083676 -0.2518863 -0.2610425 debye
polarizability: 170.7128775|2.8339557|144.2579294|16.1869582|0.519865|97.9782285 unknown
InChI: InChI=1S/C12H19NO/c1-3-9-13-10(2)12(14)11-7-5-4-6-8-11/h4-8,10,12-14H,3,9H2,1-2H3
charge 0 multiplicity 1
33 atoms
O  1.040672 -2.637279 -0.594765
N  -1.75642 -0.155662 -0.421018
C  -0.919739 -1.273826 0.079141
C  0.428969 -1.304241 -0.721364
C  -3.112663 -0.040631 0.164912
C  -0.690439 -1.196282 1.599097
C  1.471304 -0.279525 -0.27974
C  -3.920748 1.067853 -0.53856
C  1.193682 1.108151 -0.385788
C  2.726576 -0.694204 0.228314
C  -5.346147 1.212469 0.035832
C  2.156303 2.062048 0.012469
C  3.689234 0.262638 0.624785
C  3.409972 1.643984 0.517918
H  -1.418159 -2.263162 -0.135675
H  0.17512 -1.121162 -1.793436
H  -1.818296 -0.186369 -1.451389
H  -3.015522 0.210109 1.237409
H  -3.682804 -1.00436 0.108428
H  0.075572 -1.935556 1.893297
H  -0.334812 -0.191369 1.882824
H  -1.613897 -1.420201 2.161585
H  -3.368791 2.022084 -0.441033
H  -3.981696 0.845496 -1.624984
H  0.211457 1.429942 -0.747154
H  2.937829 -1.764298 0.297721
H  0.358581 -3.318211 -0.822746
H  -5.316745 1.458653 1.113834
H  -5.903717 2.016348 -0.477581
H  -5.921393 0.274618 -0.080002
H  1.927732 3.130963 -0.071278
H  4.658103 -0.072216 1.013513
H  4.158181 2.3850 0.822434
