program: Gaussian 16
title: Title
version: ES64L-G16RevA.03
basis: def2SVP
method: RPBE1PBE
operation: Freq
keyword: #
keyword: freq
keyword: pbe1pbe/def2svp
keyword: scrf=(solvent=generic,read)
keyword: em=gd3bj
title: # freq pbe1pbe/def2svp scrf=(solvent=generic,read) em=gd3bj
nucrepener: 17602.9265989099
converged: YES YES NO YES
title: Mulliken charges:
elementType: Pd P P C C C C C C C C C H H H H H H H H H H Pd P P C C C C C C C C C H H H H H H H H H H C H H C H H C H H C H H C H H C H H C H H C H H C C C C H C H C H H H C C C C H C H C H H H C C C C H C H C H H H C C C C H C H C H H H C C C C H C H C H H H C C C C H C H C H H H C C C C H C H C H H H C C C C H C H C H H H
charge: -0.452934 0.174381 0.205217 -0.216686 -0.022211 -0.083552 0.004026 -0.073332 -0.088675 -0.025261 -0.026026 -0.073286 0.074168 0.070973 0.013668 0.003068 0.039623 0.010288 0.015528 0.013773 0.012415 0.069918 -0.372102 0.266125 0.250131 -0.062508 -0.069842 -0.049025 0.027428 -0.057930 -0.081733 -0.030042 -0.022164 -0.048555 0.095698 0.137302 0.038352 0.034264 0.020399 0.003099 0.027611 0.027843 0.029671 0.065666 -0.151432 0.083451 0.076985 -0.156994 0.078468 0.105552 -0.026217 0.048098 0.054155 -0.053816 0.052535 0.072431 -0.176524 0.119040 0.080976 -0.139456 0.082078 0.073387 -0.106107 0.094553 0.064991 0.008732 0.048817 0.057798 -0.196702 -0.011391 -0.006485 -0.007336 0.090889 -0.027484 0.040144 -0.023438 0.034507 0.039984 0.041824 -0.169832 -0.024172 -0.016704 -0.022961 0.058306 -0.023880 0.048953 -0.028151 0.037267 0.038705 0.039734 -0.188562 -0.012501 -0.040320 -0.025674 0.041258 0.009005 0.109302 -0.028354 0.037910 0.030736 0.038826 -0.155808 -0.014940 0.003535 -0.032686 0.038050 -0.024516 0.040352 -0.026318 0.034267 0.036126 0.038370 -0.128406 -0.009005 -0.037882 -0.031092 0.075996 -0.021502 0.037734 -0.021277 0.031003 0.036276 0.038677 -0.129520 -0.012506 -0.056570 -0.026821 0.045275 -0.013923 0.128915 -0.020526 0.039053 0.031728 0.038025 -0.119677 -0.010460 -0.024138 -0.035503 0.045997 -0.022881 0.051303 -0.038231 0.033303 0.037274 0.043324 -0.170933 -0.040664 -0.012163 -0.030635 0.102253 -0.029773 0.036600 -0.014675 0.038839 0.040535 0.040551
chargesum: -0.00000
title: Mulliken charges with hydrogens summed into heavy atoms:
elementType: Pd P P C C C C C C C C C Pd P P C C C C C C C C C C C C C C C C C C C C C C C C C C C C C C C C C C C C C C C C C C C C C C C C C C C C C C C C C C C C C C C C C
charge: -0.383016 0.174381 0.205217 -0.071545 -0.008544 -0.080484 0.004026 -0.033709 -0.078388 -0.009733 -0.012253 -0.060871 -0.306436 0.266125 0.250131 0.170492 -0.031490 -0.014761 0.027428 -0.037532 -0.078634 -0.002431 0.005679 -0.018884 0.009005 0.027027 0.076035 0.071149 0.023492 0.016009 0.053437 0.115347 -0.196702 0.079498 0.033659 0.027171 0.012500 0.018385 -0.169832 0.034134 0.032249 0.014306 0.014826 0.011582 -0.188562 0.028756 0.068982 0.012235 0.039741 0.010472 -0.155808 0.023110 0.043887 0.001581 0.011610 0.012052 -0.128406 0.066991 -0.000147 -0.000090 0.014774 0.017400 -0.129520 0.032770 0.072345 0.012231 0.017805 0.017498 -0.119677 0.035537 0.027165 -0.002200 0.014392 0.005093 -0.170933 0.061589 0.024437 0.008204 0.010763 0.025876
chargesum: 0.00000
1716.lowfreq: -82.4358 -2.1941 -0.0011 -0.0005 0.0007 3.8040 6.2469 13.3330 16.1554
temp: 298.150 k
press: 1.00000 atm
elementType: 46 15 15 6 6 6 6 6 6 6 6 6 1 1 1 1 1 1 1 1 1 1 46 15 15 6 6 6 6 6 6 6 6 6 1 1 1 1 1 1 1 1 1 1 6 1 1 6 1 1 6 1 1 6 1 1 6 1 1 6 1 1 6 1 1 6 1 1 6 6 6 6 1 6 1 6 1 1 1 6 6 6 6 1 6 1 6 1 1 1 6 6 6 6 1 6 1 6 1 1 1 6 6 6 6 1 6 1 6 1 1 1 6 6 6 6 1 6 1 6 1 1 1 6 6 6 6 1 6 1 6 1 1 1 6 6 6 6 1 6 1 6 1 1 1 6 6 6 6 1 6 1 6 1 1 1
symmnumber: 1
zpe: 3390366.7 jmol-1
zpe.correction: 1.291322 hartree
zpe.thermalcorrener: 1.368147 hartree
zpe.thermalcorrenthalpy: 1.369091 hartree
zpe.thermalcorrgfe: 1.174113 hartree
zpe.sumelectzpe: -4479.497948 hartree
zpe.sumelectthermal: -4479.421124 hartree
zpe.sumelectthermalent: -4479.420179 hartree
zpe.sumelectthermalfe: -4479.615157 hartree
dipole: 4.1316 -6.8135 5.7182
dipole: 9.8077
quadrupole: -458.2644 -486.1696 -514.4384
quadrupole: 7.6217 -26.5216 10.1742
quadrupole: 28.0263 0.1212 -28.1476 7.6217 -26.5216 10.1742
hfenergy: -4480.7892706 hartree
pointgroup: C01 [X(C74H76P4Pd2)]
dipole: 1.6254976 -2.6806378 2.2497136 debye
polarizability: 1809.40028|20.8570239|1402.4477732|222.5911382|-76.8069677|1473.1546436 unknown
InChI: InChI=1S/2C28H28P2.2C9H9.2Pd.2H/c2*1-5-15-25(16-6-1)29(26-17-7-2-8-18-26)23-13-14-24-30(27-19-9-3-10-20-27)28-21-11-4-12-22-28;2*1-2-6-9-7-4-3-5-8-9;;;;/h2*1-12,15-22H,13-14,23-24H2;2*2-8H,1H2;;;;
charge 0 multiplicity 1
156 atoms
Pd -1.587441 0.086973 0.116519
P  -3.288386 -1.14121 1.042017
P  -1.954372 2.001696 1.504429
C  0.755664 1.028912 -3.213958
C  -0.622408 0.908754 -3.103939
C  -1.497391 1.770354 -2.43317
C  -2.92779 1.797548 -2.661903
C  -3.695277 0.648246 -2.973978
C  -3.630859 3.026705 -2.625819
C  -5.057853 0.729158 -3.229801
C  -4.996127 3.104498 -2.879913
C  -5.72971 1.956524 -3.18579
H  1.232745 1.982064 -2.972204
H  1.289846 0.389948 -3.924183
H  -1.078826 0.029621 -3.57729
H  -1.066752 2.695152 -2.031939
H  -3.210148 -0.330927 -2.980625
H  -3.07293 3.944179 -2.417555
H  -5.612187 -0.187683 -3.444849
H  -5.494734 4.077362 -2.837551
H  -6.803653 2.012308 -3.37934
H  -1.429428 -1.231087 -0.711166
Pd 1.736617 0.078924 -1.081383
P  1.654975 -2.222279 -1.477935
P  4.040374 0.387161 -1.589012
C  1.65698 2.018504 -0.27698
C  2.340781 1.756317 0.976451
C  1.824223 1.16571 2.087979
C  2.541049 0.861737 3.315901
C  3.860965 1.288252 3.57512
C  1.910773 0.081599 4.30735
C  4.514508 0.934207 4.749841
C  2.564241 -0.269274 5.485706
C  3.874955 0.151252 5.715581
H  2.186022 2.717356 -0.93385
H  0.594354 2.259996 -0.198279
H  3.405451 2.021144 1.000381
H  0.785494 0.821645 2.04322
H  4.385042 1.904675 2.841637
H  0.89049 -0.266732 4.131719
H  5.53993 1.2748 4.916449
H  2.045555 -0.880317 6.229181
H  4.392428 -0.122823 6.637833
H  0.111819 0.066165 -0.493308
C  2.885402 -2.99192 -2.62913
H  2.704548 -2.544972 -3.620131
H  2.622469 -4.055122 -2.731352
C  4.567982 -0.43716 -3.168479
H  5.293916 0.216355 -3.675429
H  3.663543 -0.450639 -3.798099
C  5.149993 -1.838942 -3.024863
H  6.161622 -1.768651 -2.595712
H  5.277416 -2.251981 -4.040153
C  4.337958 -2.811352 -2.180543
H  4.843094 -3.789096 -2.196702
H  4.374364 -2.493034 -1.124421
C  -4.096103 -0.522983 2.584174
H  -4.477467 0.485086 2.367084
H  -4.97077 -1.16197 2.78621
C  -1.730161 1.598793 3.303769
H  -0.720762 1.952074 3.557295
H  -2.428318 2.204273 3.902528
C  -1.809307 0.120561 3.677587
H  -1.200607 -0.457633 2.961396
H  -1.312336 0.004815 4.65433
C  -3.18857 -0.514931 3.8113
H  -3.738605 -0.014188 4.625939
H  -3.039049 -1.555589 4.142696
C  5.366328 -0.03966 -0.400225
C  5.011851 -0.557249 0.848488
C  6.723444 0.124999 -0.715666
C  5.994884 -0.916907 1.770821
H  3.955312 -0.673124 1.09523
C  7.704605 -0.235662 0.204248
H  7.015785 0.545166 -1.681922
C  7.341113 -0.759266 1.448153
H  5.701469 -1.313498 2.745378
H  8.759821 -0.106498 -0.048274
H  8.11376 -1.04027 2.167981
C  4.406671 2.140995 -1.965978
C  5.020473 2.982476 -1.028966
C  3.96403 2.689257 -3.17932
C  5.18136 4.341627 -1.295608
H  5.384488 2.573621 -0.083665
C  4.12995 4.046762 -3.445079
H  3.474975 2.056823 -3.923452
C  4.734917 4.879104 -2.502357
H  5.661978 4.983431 -0.553231
H  3.780455 4.457226 -4.39553
H  4.860537 5.944303 -2.709904
C  -3.683188 2.624248 1.405532
C  -4.141076 3.587237 2.317828
C  -4.558228 2.138097 0.43093
C  -5.459556 4.029443 2.274211
H  -3.461033 4.000002 3.068053
C  -5.882302 2.580193 0.389905
H  -4.207448 1.406076 -0.30062
C  -6.335913 3.519258 1.312087
H  -5.806906 4.775157 2.993381
H  -6.551245 2.186642 -0.377516
H  -7.372848 3.862725 1.280649
C  -1.057542 3.593723 1.295206
C  0.020146 4.004853 2.085153
C  -1.441554 4.395323 0.209204
C  0.702249 5.186322 1.791435
H  0.361956 3.40318 2.927694
C  -0.757379 5.569896 -0.087494
H  -2.288614 4.090863 -0.409168
C  0.322418 5.968669 0.703073
H  1.543964 5.489732 2.418706
H  -1.069509 6.177305 -0.940593
H  0.86337 6.889426 0.472033
C  -4.695313 -1.518967 -0.06046
C  -4.443694 -2.324308 -1.180219
C  -5.991695 -1.04122 0.158774
C  -5.475063 -2.672233 -2.04501
H  -3.43015 -2.685604 -1.370408
C  -7.021626 -1.376399 -0.722481
H  -6.213453 -0.402797 1.015212
C  -6.769954 -2.198829 -1.818301
H  -5.265068 -3.309606 -2.907461
H  -8.029482 -0.994728 -0.542274
H  -7.579845 -2.465986 -2.501279
C  -2.758438 -2.811775 1.578943
C  -3.699222 -3.820374 1.826348
C  -1.403423 -3.069513 1.799324
C  -3.283647 -5.070452 2.27994
H  -4.761941 -3.632674 1.650689
C  -0.988035 -4.317066 2.264167
H  -0.668802 -2.290595 1.579141
C  -1.927181 -5.319951 2.500255
H  -4.022251 -5.855047 2.461201
H  0.075444 -4.504738 2.42479
H  -1.602223 -6.301587 2.853571
C  0.133601 -3.000735 -2.142365
C  -0.603017 -3.964474 -1.446121
C  -0.279277 -2.626411 -3.428697
C  -1.726789 -4.550303 -2.029414
H  -0.305858 -4.260492 -0.439855
C  -1.40326 -3.21002 -4.009011
H  0.279724 -1.865916 -3.979775
C  -2.128315 -4.178004 -3.311728
H  -2.294405 -5.298175 -1.470238
H  -1.714025 -2.907704 -5.011945
H  -3.00833 -4.638273 -3.767534
C  2.006532 -3.123749 0.084172
C  2.041639 -2.405587 1.285332
C  2.334865 -4.487102 0.100773
C  2.414668 -3.028045 2.476946
H  1.792387 -1.339285 1.273326
C  2.707189 -5.110375 1.290067
H  2.309848 -5.073104 -0.821074
C  2.756356 -4.379863 2.47898
H  2.446642 -2.445536 3.400521
H  2.96714 -6.171499 1.287151
H  3.058695 -4.867627 3.408766
