program: Gaussian 16
title: Title Card Required
version: ES64L-G16RevC.01
frameworkgroup: C1[X(CH4O)]
method: RM06
basis: Gen
operation: Freq
keyword: #p
keyword: freq=noraman
keyword: M06/gen
keyword: integral=grid=ultrafine
keyword: scf=(intrep,xqc,maxconventionalcycles=150)
title: #p freq=noraman M06/gen integral=grid=ultrafine scf=(intrep,xqc,maxcon
basis: NPDir=0 NMtPBC= 1 NCelOv= 1 NCel= 1 NClECP= 1 NCelD= 1
basis: NCelK= 1 NCelE2= 1 NClLst= 1 CellRange= 0.0.
basis: One-electron integrals computed using PRISM.
basis: One-electron integral symmetry used in STVInt
basis: NBasis= 48 RedAO= T EigKep= 1.18D-02 NBF= 48
basis: NBsUse= 48 1.00D-06 EigRej= -1.00D+00 NBFU= 48
converged: YES YES YES YES
title: Mulliken charges:
elementType: C H H H O H
charge: 0.092357 0.022464 0.022463 0.042810 -0.366256 0.186162
chargesum: -0.00000
title: Mulliken charges with hydrogens summed into heavy atoms:
elementType: C O
charge: 0.180094 -0.180094
polarizability: 1.71264894e+01 -1.01848508e+00 1.57668576e+01 7.56840262e-07 -1.42247010e-05 1.40579581e+01
1716.lowfreq: -22.3050 0.0008 0.0012 0.0013 12.5901 12.8860 318.1295 1058.8382 1153.1680
frequency: 317.8304 1058.8379 1153.1680 1165.2459 1341.0293 1436.1935 1446.9429 1477.8629 2960.8026 3031.8134 3111.4134 3897.0653
redmass: 1.0689 1.1088 5.6373 1.3018 1.3048 1.0373 1.0647 1.1390 1.0385 1.1054 1.0996 1.0667
irintensity: 129.3252 60.6269 80.8061 1.0458 30.0161 3.2195 5.9071 10.1151 65.8250 65.7280 27.9244 48.2067
temp: 298.150 k
press: 1.00000 atm
elementType: 6 1 1 1 8 1
symmnumber: 1
zpe: 133971.0 jmol-1
zpe.correction: 0.051027 hartree
zpe.thermalcorrener: 0.054354 hartree
zpe.thermalcorrenthalpy: 0.055298 hartree
zpe.thermalcorrgfe: 0.028295 hartree
zpe.sumelectzpe: -115.509925 hartree
zpe.sumelectthermal: -115.506598 hartree
zpe.sumelectthermalent: -115.505654 hartree
zpe.sumelectthermalfe: -115.532656 hartree
dipole: -0.6435 -1.5128 0.0000
dipole: 1.6440
quadrupole: -12.5161 -12.0330 -13.4819
quadrupole: -2.1972 0.0000 -0.0000
quadrupole: 0.1609 0.6440 -0.8049 -2.1972 0.0000 -0.0000
hfenergy: -115.5609516 hartree
pointgroup: C01 [X(C1H4O1)]
dipole: -0.2531532 -0.5951956 0.0000025 debye
dipolederiv: 0.9435496 0.0610177 -0.0000012 0.0512324 0.2475811 0.0000001 -0.0000008 0.0000003 0.3833528 -0.081885 -0.0230143 0.0487004 -0.0711076 -0.0068077 0.0954771 0.0878099 0.0961612 -0.1309166 -0.081885 -0.0230147 -0.0487001 -0.0711083 -0.0068092 -0.0954777 -0.0878089 -0.096162 -0.1309145 -0.0206236 0.0444091 -0.0000001 0.0889601 -0.1065537 0.0000007 -0.0000003 0.0000008 0.0696663 -1.0452069 -0.0392497 0.0000008 0.0008578 -0.2970374 -0.0000012 0.0000002 -0.0000012 -0.5613629 0.286051 -0.0201481 0.0000001 0.0011656 0.1696269 0.0000009 0. 0.0000009 0.3701749 unknown
polarizability: 17.1264887|-1.0184855|15.7668582|0.0000008|-0.0000142|14.0579581 unknown
InChI: InChI=1S/CH4O/c1-2/h2H,1H3
charge 0 multiplicity 1
6 atoms
C  -0.647242 -0.020016 0.0000
H  -1.038523 -0.545822 0.894185
H  -1.038524 -0.545829 -0.894179
H  -1.091981 0.987149 -0.000004
O  0.739461 0.12232 -0.000001
H  1.136791 -0.753963 0.000003
