program: Gaussian 09
title: 000046275
version: EM64L-G09RevD.01
frameworkgroup: C1[X(C18H29NO)]
method: RPBEPBE
basis: SDD
operation: Freq
keyword: #p
keyword: freq=noraman
keyword: PBEPBE/SDD
title: #p freq=noraman PBEPBE/SDD
converged: YES YES NO NO
title: Mulliken charges:
elementType: O N C C C C C C C C C C C C C C C C C C H H H H H H H H H H H H H H H H H H H H H H H H H H H H H
charge: -0.472997 -0.073917 -0.385097 -0.353424 -0.377930 -0.435790 -0.383985 0.106594 -0.408579 0.459379 -0.728236 -0.410941 -0.398227 0.509493 -0.430024 -0.438907 -0.561544 -0.357225 -0.339952 -0.696620 0.168765 0.196478 0.259605 0.163461 0.184215 0.202100 0.211634 0.194498 0.187433 0.209979 0.195442 0.225171 0.197832 0.250803 0.219558 0.281091 0.207839 0.334781 0.227395 0.226565 0.201508 0.198571 0.205686 0.202702 0.194950 0.192957 0.211662 0.210430 0.214815
chargesum: 0.00000
title: Mulliken charges with hydrogens summed into heavy atoms:
elementType: O N C C C C C C C C C C C C C C C C C C
charge: -0.138217 -0.073917 -0.019854 0.069642 0.008385 -0.029657 0.013427 0.106594 0.012034 0.459379 -0.060042 -0.129849 -0.190388 0.509493 -0.202629 -0.212342 -0.161466 0.051163 0.047955 -0.059712
polarizability: 2.43715077e+02 1.43750852e+01 1.79459658e+02 1.25868471e+00 -1.01080357e+00 1.80324334e+02
1716.lowfreq: -10.3558 -8.8454 -0.0006 0.0005 0.0008 3.2911 10.4989 15.7518 16.9395
frequency: 4.6015 12.4813 16.4782 42.3907 46.4471 66.6173 85.1204 108.0859 115.0530 134.7143 154.0695 191.1836 203.8365 214.5497 232.8730 237.2355 247.5722 256.5893 266.2397 288.6642 318.7432 327.6099 340.1824 375.0484 402.9618 406.3892 434.2430 464.4428 479.0486 500.6720 543.6742 572.8046 624.5890 637.3483 677.1522 730.9282 744.9108 757.3254 783.6416 787.7453 807.1793 834.2172 838.1806 850.1556 857.1315 867.5992 900.0860 904.1890 914.9059 916.0731 952.6869 954.2420 969.0826 984.8582 992.7953 1007.9446 1013.5358 1042.4575 1053.0270 1058.2107 1064.1585 1071.2153 1105.1849 1105.5995 1113.1437 1125.3608 1131.9271 1151.7131 1156.5189 1170.1293 1176.2103 1192.8565 1205.3577 1207.7487 1217.7911 1244.6087 1254.3013 1256.6743 1264.0220 1271.2429 1283.2237 1287.4689 1309.0771 1320.4108 1322.4671 1325.0466 1336.3361 1343.5073 1345.3856 1354.1948 1368.9855 1376.7662 1378.1422 1390.4147 1392.1873 1404.7162 1441.4348 1460.9923 1464.1525 1464.6240 1468.5778 1469.5470 1470.8919 1472.3505 1478.0703 1480.5046 1481.3707 1488.8349 1492.8596 1508.1260 1581.6023 1625.1399 2747.2829 2811.6943 2834.6622 2960.8425 2966.5007 2972.2498 2972.4653 2976.1671 2980.2811 2981.5996 2998.5007 3000.1504 3016.0973 3017.5353 3022.8084 3031.9258 3042.1097 3043.9617 3053.1852 3065.3517 3067.2208 3069.3546 3070.2624 3099.9969 3103.4793 3114.0344 3128.9185 3175.6565 3551.2145
redmass: 2.9035 3.9270 3.0590 3.6726 3.6823 1.6755 2.4464 2.2698 2.9417 3.3410 2.7335 2.7258 1.7813 1.5581 1.1552 1.9296 1.1880 2.4661 2.2139 4.1112 2.9082 3.3194 2.6449 2.7468 3.0652 3.0706 3.0922 3.3882 3.7501 3.0388 3.3044 2.4766 2.4959 6.8881 3.8107 1.0766 3.3400 1.7387 1.8966 1.1860 3.9546 1.6831 2.9287 2.2195 1.3215 1.6744 1.7917 2.1154 1.9878 1.3050 1.5005 1.4814 1.7431 1.3880 1.9206 4.0334 3.0126 2.4833 1.6766 1.8862 2.5427 1.6086 1.8864 1.9580 2.4745 1.4525 2.1393 2.3789 1.6227 1.3050 2.1868 1.1409 1.5013 1.4895 2.2919 1.2285 1.3864 1.3603 1.4037 1.2369 1.0708 1.4904 1.2969 1.3006 1.4267 1.3714 1.3567 1.4527 1.5747 1.7495 1.3702 1.4040 3.6984 1.2153 1.4011 2.9845 1.0901 1.0791 1.0570 1.0727 1.0909 1.0777 1.0903 1.0897 1.0431 1.0726 1.0773 1.0881 1.0917 2.6403 6.9787 6.4898 1.0707 1.0726 1.0718 1.0586 1.0591 1.0372 1.0374 1.0591 1.0602 1.0633 1.0631 1.0986 1.0868 1.1018 1.0869 1.0911 1.0995 1.1045 1.0949 1.1034 1.0968 1.1007 1.0993 1.0981 1.0879 1.0901 1.0962 1.0933 1.0656
irintensity: 0.1060 0.2350 0.0011 0.0817 1.0536 0.0861 3.4408 0.1144 0.0144 0.6375 2.7918 6.7233 66.9299 89.3401 0.0160 8.8915 14.4754 3.5936 2.3891 1.9089 8.3026 4.2122 6.8071 1.5493 2.1316 0.7383 2.6985 3.8184 0.4484 1.5426 10.6866 23.0024 14.6927 0.1671 6.5584 6.8382 1.7490 1.6695 18.4708 1.0548 5.3764 34.0628 12.8520 10.5605 13.4515 0.8040 7.6211 3.9848 0.6204 1.4604 0.0126 0.5419 2.8667 1.7917 6.2830 0.1888 12.2820 15.2635 29.5663 26.1673 2.9587 27.7862 27.9341 17.4013 15.8937 9.3046 10.3633 38.9804 30.2943 4.7838 27.0285 1.5015 0.7904 2.2531 0.3621 1.9450 3.1098 11.6236 11.7334 0.1454 0.8448 16.0346 3.0873 5.6533 1.0020 2.2347 2.6647 0.9671 0.6323 30.3609 2.3058 20.4015 11.2803 12.2635 6.0642 8.5383 1.2144 4.1876 9.4206 0.8114 2.3252 1.0549 7.4629 10.7129 12.1562 3.3029 3.4772 18.6379 4.5869 35.1606 0.8878 1.1603 143.5088 110.6565 190.9131 16.8032 0.5845 66.3199 8.6906 111.9511 42.0279 51.1553 50.7292 4.1887 1.6283 0.7443 54.5053 11.2601 20.2166 43.6199 39.0450 98.4850 51.9774 84.5325 56.5021 14.2923 18.8313 29.4035 21.6584 2.2156 2.7357
temp: 298.150 k
press: 1.00000 atm
elementType: 8 7 6 6 6 6 6 6 6 6 6 6 6 6 6 6 6 6 6 6 1 1 1 1 1 1 1 1 1 1 1 1 1 1 1 1 1 1 1 1 1 1 1 1 1 1 1 1 1
symmnumber: 1
zpe: 1132274.4 jmol-1
zpe.correction: 0.431261 hartree
zpe.thermalcorrener: 0.453311 hartree
zpe.thermalcorrenthalpy: 0.454255 hartree
zpe.thermalcorrgfe: 0.375716 hartree
zpe.sumelectzpe: -831.698957 hartree
zpe.sumelectthermal: -831.676907 hartree
zpe.sumelectthermalent: -831.675963 hartree
zpe.sumelectthermalfe: -831.754501 hartree
dipole: -1.4236 0.5592 -1.2791
dipole: 1.9938
quadrupole: -109.4524 -126.7080 -119.6250
quadrupole: 1.6128 1.9181 2.2079
quadrupole: 9.1428 -8.1129 -1.0299 1.6128 1.9181 2.2079
hfenergy: -832.1302173 hartree
pointgroup: C01 [X(C18H29N1O1)]
dipole: 0.5731458 -0.1305426 -0.5194293 debye
polarizability: 239.4331271|21.5386083|183.6280451|-1.4574976|0.625887|180.4378977 unknown
InChI: InChI=1S/C18H29NO/c1-3-4-8-16-9-11-17(12-10-16)18(2,20)15-19-13-6-5-7-14-19/h9-12,20H,3-8,13-15H2,1-2H3
charge 0 multiplicity 1
49 atoms
O  2.465334 2.040486 1.4075
N  2.561387 -0.539452 -0.39791
C  2.830534 0.851096 -0.761553
C  3.016013 -0.925288 0.964424
C  2.920018 -1.540614 -1.426683
C  2.999475 -2.46607 1.148107
C  2.119574 -2.853875 -1.199578
C  1.994858 1.932635 0.000609
C  1.856999 -3.08742 0.315613
C  0.503863 1.58876 0.062745
C  2.216525 3.309772 -0.679111
C  -0.183301 1.50316 1.295506
C  -0.229671 1.383047 -1.133165
C  -2.306762 1.011013 0.138563
C  -1.567498 1.218772 1.328873
C  -1.609806 1.099089 -1.095149
C  -3.78876 0.667638 0.174741
C  -4.061596 -0.857392 0.046756
C  -5.568172 -1.199037 0.073282
C  -5.843732 -2.712386 -0.060609
H  3.915111 1.132636 -0.61677
H  2.623489 0.966666 -1.842283
H  2.348405 -0.443924 1.69935
H  4.050061 -0.534473 1.164216
H  4.019096 -1.761489 -1.429527
H  2.682477 -1.124603 -2.4233
H  2.883093 -2.700796 2.222461
H  3.964346 -2.907573 0.828194
H  2.690976 -3.700577 -1.629282
H  1.154156 -2.80064 -1.735464
H  1.758498 -4.169095 0.526922
H  0.904601 -2.606485 0.604988
H  3.298299 3.527911 -0.78035
H  1.753606 4.098057 -0.062167
H  1.762059 3.344873 -1.685028
H  0.375633 1.668431 2.220001
H  0.275934 1.439952 -2.105356
H  3.449282 2.158269 1.387905
H  -2.083023 1.16335 2.296401
H  -2.157733 0.948041 -2.034224
H  -4.237073 1.029229 1.121252
H  -4.319748 1.187626 -0.648279
H  -3.542521 -1.389969 0.869064
H  -3.612381 -1.229649 -0.896341
H  -6.010356 -0.823064 1.018801
H  -6.079805 -0.653832 -0.746579
H  -5.365335 -3.276351 0.762256
H  -5.441708 -3.106104 -1.01329
H  -6.92732 -2.931054 -0.035131
