program: Gaussian 09
title: 000046211
version: EM64L-G09RevD.01
frameworkgroup: C1[X(C18H21NO)]
method: RPBEPBE
basis: SDD
operation: Freq
keyword: #p
keyword: freq=noraman
keyword: PBEPBE/SDD
title: #p freq=noraman PBEPBE/SDD
converged: NO YES NO NO
title: Mulliken charges:
elementType: O N C C C C C C C C C C C C C C C C C C H H H H H H H H H H H H H H H H H H H H H
charge: -0.477740 -0.007111 -0.086537 -0.438696 -0.451804 0.010492 -0.412102 -0.415424 -0.385135 0.376563 0.394957 -0.372367 -0.402254 -0.337230 -0.507188 -0.248451 -0.223159 -0.174516 -0.243274 -0.366145 0.198308 0.207508 0.228567 0.236653 0.170122 0.201173 0.191464 0.196931 0.202923 0.201191 0.189753 0.339843 0.231561 0.286246 0.283772 0.253923 0.225326 0.223815 0.228370 0.226811 0.242862
chargesum: 0.00000
title: Mulliken charges with hydrogens summed into heavy atoms:
elementType: O N C C C C C C C C C C C C C C C C C C
charge: -0.137897 -0.007111 0.111771 -0.002621 -0.045029 0.010492 -0.019466 -0.015570 0.005809 0.376563 0.394957 -0.140806 -0.116007 -0.053458 -0.253265 -0.023125 0.000656 0.053854 -0.016464 -0.123282
polarizability: 1.89830900e+02 2.87915494e+00 2.16424380e+02 -1.02520126e+00 7.21894474e+00 1.70992042e+02
1716.lowfreq: -10.2082 -0.0007 0.0003 0.0007 8.5811 16.9802 34.1590 44.7870 59.6633
frequency: 33.7892 44.4585 59.6419 73.0861 80.0975 83.2949 167.4568 199.5163 218.9340 239.5360 251.0362 266.9109 288.4180 304.9096 312.5738 340.6452 358.4027 394.9353 402.1382 422.2655 435.4069 463.3177 489.1830 518.6259 541.9771 606.8682 616.7900 639.3989 670.5770 704.5351 727.2914 735.6188 763.4078 788.6110 796.7991 820.4754 854.1154 854.9825 866.3615 876.9192 898.8889 924.0358 926.4995 934.0634 942.6450 954.1473 972.9178 979.9405 990.2814 998.0001 1000.2702 1004.8804 1028.3074 1029.4823 1054.0002 1060.6707 1065.5568 1078.7664 1089.0322 1113.8169 1117.9610 1141.8766 1146.1283 1172.0413 1177.9978 1190.7114 1191.1333 1212.4317 1238.3609 1257.8428 1269.6452 1280.0643 1302.2746 1305.2689 1309.6398 1321.2443 1328.5272 1335.8099 1337.4078 1342.0843 1349.2701 1362.2187 1381.1962 1404.3701 1434.1894 1455.2016 1461.9651 1463.3544 1464.3635 1470.9004 1478.7250 1480.4234 1550.5066 1576.9647 1591.5319 1610.8371 2936.9537 2963.5932 2965.8157 2966.6335 2969.3680 2983.8928 3026.8524 3028.4786 3033.0164 3039.1520 3053.5297 3120.4710 3122.2422 3128.8104 3129.9642 3141.8055 3149.6483 3159.0275 3168.7298 3180.1718 3559.4986
redmass: 3.9184 4.1533 4.5491 3.5098 3.9180 3.5924 3.4003 3.6052 2.2743 3.5953 4.7355 3.8254 3.5831 3.7439 1.2901 1.9795 3.5099 2.9188 2.8210 3.2045 3.1050 3.5927 1.8336 3.3443 3.8285 7.7673 6.4202 5.7686 5.1388 1.7448 1.9866 3.1921 1.9566 1.4740 2.3678 2.1262 1.7332 1.3244 3.0939 2.3288 1.3633 1.5354 1.6662 1.7855 2.4040 1.6415 2.5904 1.3936 6.0551 1.4108 1.3555 3.2741 2.5546 2.5715 1.6652 1.4340 2.0967 1.3628 1.7789 1.9609 2.3454 2.0359 2.0929 1.0564 1.7661 1.3879 1.1984 1.8815 1.4090 1.2755 1.3183 1.4542 1.6956 2.9683 1.5606 1.3652 1.4010 1.3671 1.3573 1.5085 1.4623 1.4843 8.6472 1.9492 2.2156 1.9819 1.0883 1.0898 1.0911 1.0840 1.0978 2.2256 5.5499 5.9948 6.2845 6.0714 1.0665 1.0653 1.0641 1.0681 1.0710 1.0634 1.0950 1.0983 1.0936 1.1026 1.1013 1.0849 1.0891 1.0882 1.0886 1.0939 1.0921 1.0992 1.0992 1.0949 1.0653
irintensity: 0.0422 2.1903 0.3157 0.6781 0.3207 0.1433 1.3395 2.3923 0.2455 2.3662 0.3333 1.0018 10.3659 2.7800 107.1751 19.8119 48.0875 7.4852 3.0935 1.0069 0.6780 0.8435 4.3541 3.5590 0.3095 3.7998 0.0243 12.4895 14.4663 56.5554 37.5012 15.7051 33.8949 0.4184 17.5156 22.9384 7.9610 0.9239 9.1185 6.9931 8.9486 4.0339 14.6617 1.6469 20.4530 6.9244 12.4631 0.5686 0.6453 0.7450 0.2693 4.7799 5.6740 5.3705 2.4736 5.7009 11.2247 0.9127 2.7776 2.8088 0.1998 14.3423 29.2767 0.4203 1.9260 2.4226 4.1238 9.5268 6.1688 0.9596 3.8427 13.6778 6.3276 0.1849 8.6457 9.4082 11.9710 0.7199 6.7342 0.7396 9.7190 3.6325 1.2350 20.1017 18.3369 21.8280 0.3775 9.2608 9.1867 15.3502 1.7296 19.3644 5.4405 1.2785 0.4063 7.5281 27.1085 26.3056 45.2055 14.7414 26.8087 18.0529 94.2702 65.1178 12.0383 64.6094 51.3957 5.6601 31.0321 5.2168 5.1093 34.0381 18.4138 27.9807 18.3323 6.8667 5.5951
temp: 298.150 k
press: 1.00000 atm
elementType: 8 7 6 6 6 6 6 6 6 6 6 6 6 6 6 6 6 6 6 6 1 1 1 1 1 1 1 1 1 1 1 1 1 1 1 1 1 1 1 1 1
symmnumber: 1
zpe: 907377.3 jmol-1
zpe.correction: 0.345602 hartree
zpe.thermalcorrener: 0.363088 hartree
zpe.thermalcorrenthalpy: 0.364032 hartree
zpe.thermalcorrgfe: 0.300036 hartree
zpe.sumelectzpe: -827.018022 hartree
zpe.sumelectthermal: -827.000535 hartree
zpe.sumelectthermalent: -826.999591 hartree
zpe.sumelectthermalfe: -827.063587 hartree
dipole: 0.9756 0.2563 1.3802
dipole: 1.7095
quadrupole: -114.5815 -119.3540 -117.4680
quadrupole: -2.2221 -3.4574 -8.5350
quadrupole: 2.5530 -2.2195 -0.3335 -2.2221 -3.4574 -8.5350
hfenergy: -827.3636233 hartree
pointgroup: C01 [X(C18H21N1O1)]
dipole: -0.4048098 -0.0135794 0.5369315 debye
polarizability: 191.8365309|7.6969506|214.0409563|-0.1984474|-8.2309785|171.3698348 unknown
InChI: InChI=1S/C18H21NO/c20-18(15-8-3-1-4-9-15,16-10-5-2-6-11-16)17-12-7-13-19-14-17/h1,3-4,7-9,12-14,16,20H,2,5-6,10-11H2
charge 0 multiplicity 1
41 atoms
O  -0.250691 0.065668 2.041517
N  2.277145 2.479696 -1.366786
C  -1.420605 0.467247 -0.120842
C  -2.555316 -0.551511 0.162057
C  -1.879085 1.896758 0.278945
C  -0.067521 0.054115 0.568688
C  -3.868064 -0.150378 -0.55251
C  -3.181691 2.300916 -0.454234
C  -4.313359 1.283193 -0.182531
C  0.324657 -1.394122 0.207312
C  1.108779 0.995263 0.21293
C  0.674369 -1.720521 -1.127252
C  0.329905 -2.414468 1.188078
C  2.177964 1.14713 1.132866
C  1.21909 1.685573 -1.022219
C  1.013832 -3.045175 -1.477836
C  0.675875 -3.739891 0.838104
C  3.278924 1.961964 0.797266
C  1.016514 -4.062518 -0.494894
C  3.288886 2.608793 -0.459968
H  -1.242843 0.463344 -1.217269
H  -2.722514 -0.606755 1.256407
H  -2.248166 -1.5621 -0.163436
H  -1.084458 2.638347 0.073817
H  -2.084231 1.928858 1.372374
H  -4.665632 -0.875615 -0.299583
H  -3.719806 -0.212056 -1.651135
H  -2.985308 2.350317 -1.545388
H  -3.490225 3.31642 -0.139114
H  -5.222943 1.561542 -0.749341
H  -4.582433 1.316636 0.893792
H  -0.541435 0.976579 2.300853
H  0.697643 -0.941264 -1.898023
H  0.062724 -2.157825 2.216015
H  2.131984 0.621906 2.091922
H  0.432559 1.619228 -1.782916
H  1.283447 -3.280964 -2.513524
H  0.677252 -4.520257 1.607865
H  4.116741 2.092964 1.489818
H  1.284435 -5.09028 -0.764795
H  4.124803 3.250046 -0.762132
