program: Gaussian 09
title: 000007040
version: EM64L-G09RevD.01
frameworkgroup: C1[X(C9H6N2O2)]
method: RPBEPBE
basis: SDD
operation: Freq
keyword: #pfreq=noraman
keyword: PBEPBE/SDD
title: #p freq=noraman PBEPBE/SDD
converged: NO YES NO NO
title: Mulliken charges:
elementType: O O N N C C C C C C C C C H H H H H H
charge: -0.171279 -0.171212 0.069534 0.069526 0.154034 0.269607 0.269470 -0.776862 -0.393374 -0.393274 -0.169311 -0.120158 -0.120317 0.239578 0.251445 0.239707 0.254926 0.254957 0.243003
chargesum: 0.00000
title: Mulliken charges with hydrogens summed into heavy atoms:
elementType: O O N N C C C C C C C C C
charge: -0.171279 -0.171212 0.069534 0.069526 0.154034 0.269607 0.269470 -0.046132 -0.138448 -0.138317 0.073692 -0.120158 -0.120317
polarizability: 2.03314876e+02 2.73745827e-02 1.27139825e+02 1.88512844e-03 -5.33891648e-01 4.73425505e+01
1716.lowfreq: -76.3260 -43.0614 -32.1844 -9.9684 -2.3913 -0.0010 -0.0007 -0.0006 5.3945
frequency: -76.3257 -43.0047 -32.1844 47.5593 79.7022 159.5080 247.0836 295.0970 313.7454 320.1361 371.1579 429.8513 470.9148 472.3465 483.4055 485.9582 509.2803 531.0509 597.9419 602.7815 714.4369 796.3069 803.4841 812.4287 902.7150 975.6507 1011.1185 1037.1115 1072.6759 1110.0583 1158.7113 1211.9230 1218.0416 1360.2072 1397.3246 1401.2046 1427.0722 1470.0361 1472.3520 1515.8065 1520.6009 1589.9418 1591.0781 2382.7753 2398.2682 2984.0860 3069.2970 3105.7825 3147.7660 3166.3280 3179.6704
redmass: 1.3067 3.2230 13.1161 6.2671 8.8373 4.7652 4.7068 4.9272 2.9399 11.1413 8.6385 7.0995 12.5084 12.5436 12.1343 12.6500 3.3047 4.4519 5.4209 6.3645 2.0199 4.5049 1.8341 4.6828 1.4076 1.3418 1.6224 1.5167 2.1299 10.2061 1.3131 2.6344 1.6066 8.0692 2.2179 1.2125 3.1963 1.1055 1.1020 7.1389 10.7707 6.5232 6.7762 12.7390 12.7370 1.0418 1.0915 1.0996 1.0870 1.0928 1.1001
irintensity: 0.5993 0.6113 0.4471 0.8604 0.0065 1.9504 0.0006 2.3976 2.3402 3.0203 3.6843 0.1517 0.1183 28.0003 9.5814 21.9246 0.1574 0.1143 0.0786 1.7918 17.8554 3.9790 65.9802 63.5225 0.0007 1.5454 98.9912 3.9611 10.0269 24.0786 4.5380 1.7964 6.8274 4.6094 59.0562 12.2823 15.6328 14.1054 18.9865 1.9115 0.2022 15.5556 100.5126 2598.1701 519.8058 13.3786 14.6657 9.3110 4.2622 6.9496 7.9016
temp: 298.150 k
press: 1.00000 atm
elementType: 8 8 7 7 6 6 6 6 6 6 6 6 6 1 1 1 1 1 1
symmnumber: 1
zpe: 343458.5 jmol-1
zpe.correction: 0.130816 hartree
zpe.thermalcorrener: 0.140588 hartree
zpe.thermalcorrenthalpy: 0.141533 hartree
zpe.thermalcorrgfe: 0.094542 hartree
zpe.sumelectzpe: -605.617310 hartree
zpe.sumelectthermal: -605.607538 hartree
zpe.sumelectthermalent: -605.606593 hartree
zpe.sumelectthermalfe: -605.653584 hartree
dipole: -0.0063 2.6134 0.0281
dipole: 2.6136
quadrupole: -101.2067 -67.5894 -74.4618
quadrupole: -0.0329 0.0013 0.1630
quadrupole: -20.1207 13.4966 6.6241 -0.0329 0.0013 0.1630
hfenergy: -605.7481261 hartree
pointgroup: C01 [X(C9H6N2O2)]
dipole: 0.0027834 -0.9903669 0.2765812 debye
dipolederiv: -1.7017778 -0.5982979 0.1421423 -0.7817752 -0.586814 0.0757938 0.1825414 0.0749087 -0.2841726 -1.709311 0.6020329 -0.1430397 0.7679229 -0.5812893 0.0745136 -0.1795554 0.0737239 -0.2838948 -1.9814674 -0.6996586 0.1711762 -0.855404 -0.6535706 0.1149493 0.1914016 0.1124064 -0.2155152 -1.9836204 0.6972293 -0.1707843 0.8554961 -0.6516573 0.1145755 -0.1916639 0.1121165 -0.215445 -0.481953 0.000211 -0.0001039 0.0000581 0.2282139 -0.0717044 0.0000156 -0.0392166 -0.0592079 1.297765 0.4167082 -0.1025731 0.4717598 0.3533497 -0.0612754 -0.1064167 -0.0649154 0.1182737 1.2981521 -0.4168381 0.102801 -0.4713591 0.3531105 -0.0612706 0.1064007 -0.0649142 0.1183766 0.0239098 -0.0007797 0.0002664 -0.0003886 -0.1640922 0.0577562 0.0000979 -0.0066437 0.0733415 -0.1789961 -0.0408805 0.0073164 -0.1429007 -0.1550784 -0.0066494 0.0362227 -0.0087735 -0.1729335 -0.1794081 0.0409945 -0.0073446 0.1428645 -0.1548499 -0.0066958 -0.0361804 -0.0088404 -0.1729503 0.0305018 -0.0000067 0.0000134 0.0001509 0.1157969 -0.0725116 -0.0000439 -0.0680805 -0.1145598 2.7451123 1.0332843 -0.2413719 1.2986734 0.8695073 -0.12761 -0.2904346 -0.1251878 0.3368834 2.7545537 -1.0345559 0.2417246 -1.2851464 0.8621699 -0.1259038 0.2876717 -0.1236603 0.3365332 -0.0272084 0.0576669 -0.1146737 0.0242579 0.0676608 0.0123229 -0.0757011 0.0506504 0.0516719 0.1236601 -0.0003319 -0.0005303 -0.0003079 -0.0268017 -0.0553549 -0.0004127 -0.0909751 -0.0382568 -0.0266833 -0.0568287 0.115014 -0.0238727 0.067591 0.0121658 0.0760712 0.0507227 0.0509258 -0.0382904 0.0690251 -0.0193326 0.0576503 0.0695894 0.0294728 -0.0174801 0.0291692 0.163672 -0.0382983 -0.068927 0.0192912 -0.0576082 0.0696866 0.0294431 0.0174505 0.0291406 0.1636939 0.0733594 -0.000047 0.0000084 -0.0000711 -0.0825226 0.0679827 0.0000155 0.0683691 0.1435636 unknown
polarizability: 203.314853|0.0495574|122.0705031|-0.008806|-19.4706647|52.4118952 unknown
InChI: InChI=1S/C9H6N2O2/c1-7-8(10-5-12)3-2-4-9(7)11-6-13/h2-4H,1H3
charge 0 multiplicity 1
19 atoms
O  4.551864 1.364689 -0.481187
O  -4.555761 1.358306 -0.479985
N  2.429448 0.212264 -0.220602
N  -2.428478 0.214434 -0.22142
C  0.00049 0.27634 -0.255466
C  1.218598 -0.43878 -0.048657
C  -1.218274 -0.43771 -0.049021
C  0.001365 1.735141 -0.655977
C  1.221193 -1.806872 0.333344
C  -1.22206 -1.805833 0.332972
C  -0.000751 -2.481146 0.520199
C  3.485585 0.783043 -0.347175
C  -3.484064 0.786189 -0.348167
H  -0.893212 1.989242 -1.247982
H  0.004258 2.393305 0.234718
H  0.893966 1.986996 -1.251971
H  2.177274 -2.318118 0.478432
H  -2.178606 -2.31629 0.477764
H  -0.001235 -3.5352 0.814682
